program: Gaussian 09
title: 000214545
version: EM64L-G09RevD.01
frameworkgroup: C1[X(C20H21NO4)]
method: RPBEPBE
basis: SDD
operation: Freq
keyword: #p
keyword: freq=noraman
keyword: PBEPBE/SDD
title: #p freq=noraman PBEPBE/SDD
converged: YES YES NO NO
title: Mulliken charges:
elementType: O O O O N C C C C C C C C C C C C C C C C C C C C H H H H H H H H H H H H H H H H H H H H H
charge: -0.287869 -0.180326 -0.272623 -0.421705 -0.041794 0.315984 -0.489118 -0.498521 -0.392416 -0.386775 0.013872 -0.623601 0.321742 0.231770 -0.379337 -0.323979 0.201595 -0.233624 -0.262608 -0.228939 -0.319935 -0.314643 -0.381344 -0.334025 0.295480 0.246125 0.222825 0.274311 0.184813 0.198832 0.223014 0.173908 0.217857 0.231016 0.224984 0.187205 0.258519 0.264425 0.230599 0.230251 0.230840 0.268540 0.283387 0.225904 0.256211 0.359170
chargesum: 0.00000
title: Mulliken charges with hydrogens summed into heavy atoms:
elementType: O O O O N C C C C C C C C C C C C C C C C C C C C
charge: -0.287869 -0.180326 -0.272623 -0.062534 -0.041794 0.315984 -0.020167 -0.039397 0.029430 0.004990 0.013872 0.019605 0.321742 0.231770 -0.120819 -0.059554 0.201595 -0.003025 -0.032358 0.001901 -0.051394 -0.031256 -0.155440 -0.077814 0.295480
polarizability: 3.33537331e+02 1.47315847e+01 2.27902004e+02 -2.92753180e+00 -2.34778532e+01 1.71551630e+02
1716.lowfreq: -5.5549 -4.3235 0.0005 0.0005 0.0008 5.5164 25.2133 33.9502 40.4832
frequency: 25.1570 33.9311 40.4710 44.6046 47.0737 82.1248 98.1710 112.4649 114.8984 123.1876 160.1468 175.8740 194.3813 212.0622 228.0762 247.2896 254.7273 276.0582 299.7316 341.4702 354.2588 357.0000 375.0450 381.9896 394.9935 402.1041 402.8559 415.4626 419.3247 478.3028 486.5846 503.9431 515.1071 557.7729 601.9344 614.6576 631.1653 647.3073 675.3161 691.7798 702.6351 709.9543 751.8817 769.6047 778.9051 799.0161 819.0706 827.3145 833.2417 851.7671 856.0796 871.3048 909.7988 918.0436 930.1158 952.0360 969.3600 980.8492 988.9111 989.7323 990.1988 999.8440 1001.7958 1023.6578 1031.9459 1056.5020 1063.9359 1077.9180 1084.9538 1096.5860 1102.9672 1124.3141 1134.9193 1145.2119 1157.4786 1173.2556 1175.1074 1189.0942 1194.5814 1225.0561 1238.6330 1249.5894 1259.5543 1277.6453 1285.0662 1299.6576 1310.9019 1316.9157 1332.3707 1348.1976 1363.1842 1373.2287 1377.9932 1399.4416 1429.9873 1431.0430 1431.2533 1451.0950 1453.0607 1459.8119 1464.0579 1474.7246 1475.8629 1481.1865 1501.4398 1562.7710 1576.6230 1586.1485 1599.9500 1606.6922 1625.1028 2796.7254 2811.3453 2853.9454 2999.3217 3002.5778 3020.1691 3030.5191 3059.2842 3064.4379 3079.8240 3083.9877 3120.6907 3126.8284 3137.4766 3150.2509 3163.7529 3163.9620 3163.9999 3183.3948 3190.0222 3577.4029
redmass: 6.1149 5.6596 4.1349 4.1723 3.7422 3.9271 5.6283 5.3505 6.6120 6.6165 5.1594 3.3255 4.4450 1.2307 3.7832 3.0448 2.8113 7.1784 4.7695 2.4914 4.9411 4.5382 3.1451 3.6023 1.1712 3.1232 2.8442 2.7902 3.4658 4.1578 4.1925 2.9452 2.3759 4.9063 6.9866 6.3923 7.0255 4.7640 4.2353 5.5163 1.7348 3.5559 4.7080 3.2033 3.2964 3.3198 1.3415 4.9597 4.5172 1.5800 1.2636 1.6523 2.7420 2.6582 1.7707 2.2269 1.3532 1.4649 1.3475 2.1822 3.5669 1.3869 3.0759 2.6131 1.9782 2.3488 3.7493 2.0301 1.6262 1.6132 1.4388 1.7844 1.6817 1.3628 2.3927 1.0541 1.1537 1.1518 1.5194 2.4576 4.0205 2.1700 2.1678 2.1776 1.8020 1.3849 1.3954 1.3530 1.3537 1.3677 1.4900 1.3988 8.0614 4.8559 1.1701 3.4759 2.3322 1.0884 1.0863 1.0788 1.0814 1.6160 1.3349 1.0572 2.8096 9.8825 8.9150 6.6791 8.0316 6.0668 6.4292 1.0706 1.0696 1.0575 1.0626 1.0639 1.0719 1.0863 1.0870 1.1011 1.1010 1.0984 1.0900 1.0851 1.0890 1.0943 1.0949 1.0979 1.0906 1.0977 1.0945 1.0660
irintensity: 1.3967 1.0753 0.4247 0.4723 1.6237 0.4918 0.7170 0.3331 2.4802 0.2792 2.3522 3.2586 2.8530 0.2339 1.4246 3.0309 5.5978 14.8575 6.9157 6.1988 4.2850 1.3968 0.0539 7.5896 137.5938 1.3510 1.9623 5.4904 0.1171 4.5620 25.4711 15.9864 3.1032 1.7119 15.8130 0.4897 0.8256 30.6116 28.5115 4.4359 73.3343 1.9448 16.1407 37.9457 12.8081 9.0575 15.4307 29.8668 30.3854 41.7118 1.2700 9.4362 6.0379 25.5830 6.1761 36.5326 0.7292 3.1712 0.0811 11.0125 3.9722 0.2539 30.3800 21.9231 5.9907 65.3197 288.8515 2.4747 18.5272 7.1532 39.0199 10.1668 1.8817 339.9717 62.2806 0.4117 59.6200 26.1766 18.8969 11.5159 148.3446 40.3309 217.0065 26.4796 113.7292 4.9342 6.1802 0.5519 10.4735 0.4643 0.7032 0.6124 1.1613 56.6404 0.1334 13.5903 16.2313 12.7806 14.0930 36.6275 0.6746 9.6850 7.8333 7.5328 52.9408 102.2821 88.2389 12.3548 252.8058 20.7118 140.5514 65.6591 118.9116 204.4697 27.8161 22.7833 39.6482 59.7173 5.4174 31.2629 31.1566 22.5310 17.5934 0.0370 8.7647 20.7597 5.0568 31.2913 1.5405 4.6934 4.9197 67.0891
temp: 298.150 k
press: 1.00000 atm
elementType: 8 8 8 8 7 6 6 6 6 6 6 6 6 6 6 6 6 6 6 6 6 6 6 6 6 1 1 1 1 1 1 1 1 1 1 1 1 1 1 1 1 1 1 1 1 1
symmnumber: 1
zpe: 963597.1 jmol-1
zpe.correction: 0.367015 hartree
zpe.thermalcorrener: 0.389704 hartree
zpe.thermalcorrenthalpy: 0.390649 hartree
zpe.thermalcorrgfe: 0.314041 hartree
zpe.sumelectzpe: -1128.544793 hartree
zpe.sumelectthermal: -1128.522103 hartree
zpe.sumelectthermalent: -1128.521159 hartree
zpe.sumelectthermalfe: -1128.597767 hartree
dipole: -0.2630 0.4689 2.6800
dipole: 2.7334
quadrupole: -118.6212 -132.1377 -148.8093
quadrupole: -13.3418 1.1751 -6.0308
quadrupole: 14.5682 1.0517 -15.6199 -13.3418 1.1751 -6.0308
hfenergy: -1128.9118078 hartree
pointgroup: C01 [X(C20H21N1O4)]
dipole: -0.0980749 -0.1602006 -1.0588702 debye
polarizability: 333.212963|-15.6245469|229.1964609|3.4541369|-22.3378828|170.5815412 unknown
InChI: InChI=1S/C20H21NO4/c1-21-13-5-12-20(14-21,18(23)15-6-3-2-4-7-15)25-19(24)16-8-10-17(22)11-9-16/h2-4,6-11,22H,5,12-14H2,1H3
charge 0 multiplicity 1
46 atoms
O  0.559924 -0.702594 0.140779
O  -1.257688 0.33436 2.115907
O  0.33685 1.536105 -0.461095
O  6.750285 0.793119 0.330957
N  -0.679518 -3.371893 0.075578
C  -0.931482 -0.861056 0.030652
C  -1.326484 -0.95124 -1.458451
C  -1.233591 -2.193732 0.764098
C  -0.759722 -2.230608 -2.114015
C  -1.162584 -3.484853 -1.317571
C  -1.621106 0.247928 0.908905
C  -0.876394 -4.603608 0.861117
C  -2.813254 1.02825 0.429064
C  1.07247 0.560752 -0.139052
C  -3.940433 1.076547 1.294895
C  -2.839052 1.765103 -0.784115
C  2.548446 0.606775 -0.014931
C  -5.08888 1.811378 0.935649
C  -3.983042 2.515118 -1.130852
C  -5.114629 2.531462 -0.28204
C  3.207384 1.843084 -0.239624
C  3.312935 -0.544573 0.322185
C  4.60597 1.9357 -0.13132
C  4.710644 -0.461705 0.431116
C  5.355843 0.778893 0.204673
H  -0.978835 -0.056459 -1.999337
H  -2.432145 -0.962749 -1.519516
H  -0.806399 -2.120133 1.778883
H  -2.352031 -2.262979 0.870422
H  -1.133074 -2.309527 -3.152489
H  0.343558 -2.176011 -2.150864
H  -2.279434 -3.611062 -1.357691
H  -0.712871 -4.387284 -1.771378
H  -0.415595 -4.488189 1.858302
H  -0.382777 -5.450187 0.351205
H  -1.954736 -4.870124 1.00777
H  -3.897245 0.538298 2.24804
H  -1.94618 1.798866 -1.411932
H  -5.956291 1.831311 1.604598
H  -3.98646 3.098607 -2.058244
H  -6.002497 3.110748 -0.559682
H  2.604418 2.720741 -0.493764
H  2.796501 -1.492419 0.496991
H  5.111013 2.89496 -0.302848
H  5.318185 -1.333309 0.690139
H  7.115398 1.697982 0.165286
