program: Gaussian 09
title: 000012386
version: EM64L-G09RevD.01
frameworkgroup: C1[X(C8H18S2)]
method: RPBEPBE
basis: SDD
operation: Freq
keyword: #pfreq=noraman
keyword: PBEPBE/SDD
title: #p freq=noraman PBEPBE/SDD
converged: YES YES NO NO
title: Mulliken charges:
elementType: S S C C C C C C C C H H H H H H H H H H H H H H H H H H
charge: 0.015967 0.016010 -0.307577 -0.307439 -0.320174 -0.320131 -0.693835 -0.693890 -0.684183 -0.684256 0.226415 0.199441 0.226474 0.199370 0.185427 0.217112 0.185357 0.217204 0.256657 0.270379 0.256693 0.270338 0.216753 0.204417 0.213145 0.216790 0.204420 0.213117
chargesum: 0.00000
title: Mulliken charges with hydrogens summed into heavy atoms:
elementType: S S C C C C C C C C
charge: 0.015967 0.016010 0.118278 0.118404 0.082365 0.082430 -0.166799 -0.166860 -0.049868 -0.049929
polarizability: 1.63868558e+02 -1.11170561e+01 1.10718507e+02 1.20247847e-01 -8.41788374e-02 1.02817568e+02
1716.lowfreq: 0.0026 0.0030 0.0032 7.7597 11.8840 28.8782 30.8053 31.8645 39.4290
frequency: 29.1196 30.8050 39.3830 72.7066 79.3980 108.3042 119.6681 150.0686 189.9916 230.7231 233.7289 254.3752 266.0395 304.1144 308.5778 412.1927 463.6256 470.8993 582.1624 585.0003 743.0143 744.8796 793.6340 794.4923 867.4327 868.4129 914.0416 915.6210 1016.6054 1016.7476 1061.8403 1064.1145 1068.1973 1070.4249 1106.7006 1108.4420 1192.9056 1193.5003 1221.3629 1224.3032 1267.8667 1273.0392 1288.8148 1292.0182 1303.0428 1303.8689 1355.6850 1356.2261 1387.9730 1388.1871 1422.7379 1423.0172 1458.4919 1459.2952 1474.5746 1474.6375 1478.3807 1478.8500 1486.0608 1486.1793 2957.6895 2957.7795 2970.7417 2970.8752 2972.4304 2972.6093 2996.9223 2997.0347 3014.4708 3014.6915 3036.1465 3036.2124 3069.3938 3069.5448 3073.4193 3073.4572 3079.6547 3080.7854
redmass: 4.5808 5.0265 3.4336 1.8062 2.0032 2.5133 3.0796 3.1436 5.4334 1.1442 1.1496 1.9856 2.0744 2.6528 3.1466 13.4533 2.8592 3.0127 4.5654 4.5028 1.1497 1.1440 1.7503 1.7248 1.3365 1.3119 1.4405 1.4213 2.5404 2.5613 1.3980 1.6218 1.7395 1.4978 2.1049 2.0919 1.4446 1.4563 1.3492 1.3435 1.2214 1.2117 1.1074 1.1241 1.2773 1.2690 1.6127 1.6099 1.2120 1.2126 1.0952 1.0930 1.0742 1.0746 1.0556 1.0554 1.0429 1.0429 1.0786 1.0789 1.0615 1.0614 1.0584 1.0585 1.0406 1.0404 1.0642 1.0640 1.0901 1.0903 1.1007 1.1008 1.1006 1.1006 1.0996 1.0996 1.1044 1.1035
irintensity: 0.2633 0.3766 0.0066 0.1135 0.5059 0.5001 0.0000 0.5406 2.6132 0.0261 0.0083 0.0695 1.0770 0.1795 0.0291 0.0766 2.2992 0.0022 0.3092 3.2137 23.1946 4.5621 2.6941 1.7478 9.4370 0.9089 9.2494 23.0082 4.0511 4.5487 0.2508 3.5362 3.4559 0.9966 2.6220 2.3880 4.5240 0.8921 4.9163 0.8052 22.6511 3.4177 18.0278 0.6028 3.6001 0.5467 1.9108 1.4253 14.0869 8.7923 14.6412 7.4385 13.6381 1.1444 1.1849 7.2699 11.3720 11.4181 14.6957 15.6760 22.9054 22.3653 44.1220 56.4611 46.9879 11.6280 10.4233 15.0799 12.2574 5.8259 16.9261 20.6530 61.7426 83.5664 79.2807 21.9173 15.8360 15.1971
temp: 298.150 k
press: 1.00000 atm
elementType: 16 16 6 6 6 6 6 6 6 6 1 1 1 1 1 1 1 1 1 1 1 1 1 1 1 1 1 1
symmnumber: 1
zpe: 640722.1 jmol-1
zpe.correction: 0.244038 hartree
zpe.thermalcorrener: 0.258645 hartree
zpe.thermalcorrenthalpy: 0.259589 hartree
zpe.thermalcorrgfe: 0.200137 hartree
zpe.sumelectzpe: -1110.921939 hartree
zpe.sumelectthermal: -1110.907332 hartree
zpe.sumelectthermalent: -1110.906387 hartree
zpe.sumelectthermalfe: -1110.965840 hartree
dipole: -0.0010 0.0223 2.1610
dipole: 2.1611
quadrupole: -73.6184 -80.3287 -78.2364
quadrupole: -2.9099 0.0329 0.0259
quadrupole: 3.7761 -2.9342 -0.8419 -2.9099 0.0329 0.0259
hfenergy: -1111.1659768 hartree
pointgroup: C01 [X(C8H18S2)]
dipole: -0.0002095 -0.8502247 0.0056736 debye
polarizability: 163.5973412|-0.0704041|102.8170362|-11.7447793|0.0545398|110.9902551 unknown
InChI: InChI=1S/C8H18S2/c1-3-5-7-9-10-8-6-4-2/h3-8H2,1-2H3
charge 0 multiplicity 1
28 atoms
S  0.455217 0.233233 -1.037762
S  -0.455951 0.247971 1.040719
C  2.954779 -0.649489 0.1184
C  -2.954127 -0.652214 -0.105706
C  3.803887 0.516851 -0.433116
C  -3.80284 0.524052 0.424657
C  1.810052 -1.088951 -0.805409
C  -1.811089 -1.077151 0.82686
C  4.920237 0.944378 0.543558
C  -4.920434 0.932447 -0.558886
H  2.531205 -0.37641 1.10579
H  3.610612 -1.529673 0.291287
H  -2.528923 -0.396395 -1.096988
H  -3.610605 -1.534581 -0.264341
H  4.25094 0.216989 -1.403403
H  3.13899 1.376839 -0.643775
H  -4.248806 0.242522 1.400918
H  -3.13816 1.388142 0.618357
H  2.161262 -1.272524 -1.839617
H  1.309044 -2.00009 -0.437426
H  -2.164058 -1.244068 1.863299
H  -1.309691 -1.994127 0.474265
H  5.519262 1.776458 0.13054
H  5.609196 0.104967 0.757112
H  4.49312 1.281206 1.506833
H  -5.518884 1.772676 -0.161837
H  -5.609762 0.089061 -0.754909
H  -4.494472 1.249983 -1.52922
