program: Gaussian 09
title: 000214483
version: EM64L-G09RevD.01
frameworkgroup: C1[X(C7H15NO2S4)]
method: RPBEPBE
basis: SDD
operation: Freq
keyword: #p
keyword: freq=noraman
keyword: PBEPBE/SDD
title: #p freq=noraman PBEPBE/SDD
converged: YES YES NO NO
title: Mulliken charges:
elementType: S S S S O O N C C C C C C C H H H H H H H H H H H H H H H
charge: 0.757741 0.106859 -0.014789 0.064416 -0.605326 -0.571167 0.014605 -0.325910 -0.269765 -0.668694 -0.726276 -0.429417 -0.605527 -0.614504 0.202201 0.246749 0.234721 0.221801 0.316248 0.264138 0.273142 0.277072 0.212853 0.265645 0.265929 0.264023 0.236404 0.250254 0.356571
chargesum: 0.00000
title: Mulliken charges with hydrogens summed into heavy atoms:
elementType: S S S S O O N C C C C C C C
charge: 0.757741 0.106859 -0.014789 0.064416 -0.248755 -0.571167 0.014605 0.123040 0.186757 -0.088307 -0.176062 -0.429417 0.138900 0.136178
polarizability: 2.16989184e+02 2.09237877e+01 1.71151066e+02 2.47062314e+01 -9.06184774e+00 1.32491363e+02
1716.lowfreq: -7.5223 -4.7030 -0.0021 0.0010 0.0023 8.3614 13.3445 23.2403 31.5659
frequency: 12.5386 22.7217 31.4705 34.3960 44.2194 55.1041 78.1101 85.2465 99.6625 104.9989 109.2398 135.4892 173.3515 193.2549 212.8326 232.3249 255.0446 265.2547 297.5623 306.8738 320.4470 348.2485 349.3612 409.2499 432.7273 457.3326 518.7228 528.0395 541.2575 607.0907 669.8405 733.0604 764.8711 821.5878 858.5157 879.6417 946.9282 1015.3626 1026.9266 1032.9199 1044.3257 1045.5382 1083.6301 1085.2380 1094.6518 1122.2245 1146.3229 1209.4277 1222.7032 1235.0236 1249.5357 1286.7702 1294.6540 1316.6668 1350.7549 1374.4805 1424.2857 1425.9334 1426.8017 1446.9595 1460.3503 1462.9416 1473.1815 1476.6616 1482.1021 1500.7377 2976.1534 2978.0086 2989.3797 2997.6507 3006.0989 3032.7965 3037.6596 3061.1784 3066.8687 3076.8059 3089.8717 3098.5399 3112.7064 3126.1595 3504.6569
redmass: 5.2586 6.5759 4.1697 6.6790 4.1699 1.4452 3.8512 1.4774 2.0342 2.3035 2.2937 4.3927 4.9420 4.5989 4.6880 3.8695 3.8579 4.4167 6.6185 1.3511 4.8441 6.3197 5.1292 5.2414 3.1451 18.7213 14.4679 7.8054 4.4831 5.3646 4.9385 1.1154 1.1956 5.3708 2.4668 2.4811 4.5570 1.5777 3.1091 1.4561 1.6209 2.2641 2.7243 1.2542 1.0753 1.3810 1.7696 1.1745 1.3757 3.7978 1.2095 1.1666 1.0550 1.2819 1.4203 2.5135 1.0982 1.1109 1.1098 1.0453 1.1698 1.0852 1.0531 1.0498 1.0932 1.3782 1.0356 1.0591 1.0339 1.0611 1.0598 1.0989 1.0588 1.1022 1.0990 1.1008 1.1044 1.1011 1.1018 1.1089 1.0668
irintensity: 1.4965 1.2455 5.3059 0.3504 2.9408 0.1329 1.3570 0.3500 0.6846 2.2079 0.6801 1.1990 0.2639 1.7647 10.4793 7.0238 1.8754 4.7292 3.1443 128.6724 15.6902 26.4831 13.1286 3.7277 2.9880 3.5901 60.6596 2.9395 3.5884 2.1556 2.5587 9.3659 2.1119 33.8348 17.9232 34.7419 114.9125 40.2459 21.2320 4.6654 13.2719 13.7809 3.7114 6.4698 1.8197 4.7059 46.0616 5.1206 0.2701 42.0429 0.9409 0.9988 1.6058 36.2030 2.0221 108.3596 8.7945 5.6368 15.7907 16.7109 6.0028 4.7746 12.2197 13.0480 19.5524 152.6421 32.5046 12.1386 46.0630 1.6542 19.7639 3.8994 5.7146 10.8155 16.1311 18.4676 17.1900 12.1737 28.5354 6.3510 23.1144
temp: 298.150 k
press: 1.00000 atm
elementType: 16 16 16 16 8 8 7 6 6 6 6 6 6 6 1 1 1 1 1 1 1 1 1 1 1 1 1 1 1
symmnumber: 1
zpe: 573658.8 jmol-1
zpe.correction: 0.218495 hartree
zpe.thermalcorrener: 0.238676 hartree
zpe.thermalcorrenthalpy: 0.239620 hartree
zpe.thermalcorrgfe: 0.164345 hartree
zpe.sumelectzpe: -2071.949969 hartree
zpe.sumelectthermal: -2071.929788 hartree
zpe.sumelectthermalent: -2071.928844 hartree
zpe.sumelectthermalfe: -2072.004119 hartree
dipole: -3.5686 -3.3400 -4.3110
dipole: 6.5173
quadrupole: -102.9710 -113.0981 -116.0811
quadrupole: -0.7595 7.3748 5.3207
quadrupole: 7.7457 -2.3814 -5.3643 -0.7595 7.3748 5.3207
hfenergy: -2072.1684638 hartree
pointgroup: C01 [X(C7H15N1O2S4)]
dipole: 1.7698953 1.7803728 -0.5218368 debye
polarizability: 225.544658|16.7941389|142.7802297|1.4146289|24.1824368|152.3067253 unknown
InChI: InChI=1S/C7H15NO2S4/c1-8(2)7(11)13-12-5-3-4-6-14(9)10/h9H,3-6H2,1-2H3
charge 0 multiplicity 1
29 atoms
S  -4.641872 1.322507 -0.421404
S  1.001391 -2.992316 -0.23983
S  2.625071 -1.516922 -0.707782
S  1.842554 -0.653711 2.252027
O  -5.21552 1.619923 1.366537
O  -5.369729 -0.021083 -1.015651
N  4.046341 0.176667 0.885957
C  -2.344663 -0.350394 -0.655004
C  -1.111077 -1.031254 -0.004782
C  -2.966721 0.6655 0.30322
C  -0.52081 -2.095999 -0.938568
C  2.898437 -0.573707 0.92968
C  4.358938 1.062077 2.032933
C  4.988544 0.186917 -0.256768
H  -2.040851 0.141369 -1.600736
H  -3.110592 -1.108643 -0.911905
H  -0.334748 -0.281878 0.23764
H  -1.398459 -1.500472 0.954886
H  -3.272402 0.228327 1.268007
H  -2.358213 1.569374 0.469643
H  -1.232754 -2.925826 -1.114573
H  -0.228518 -1.679522 -1.917239
H  5.201336 1.71713 1.758266
H  4.621307 0.463338 2.923953
H  3.477786 1.673631 2.292307
H  5.009245 -0.800426 -0.748653
H  6.003091 0.40335 0.115308
H  4.711096 0.952423 -1.006563
H  -6.12371 2.032418 1.315394
