program: Gaussian 09
title: 000214462
version: EM64L-G09RevD.01
frameworkgroup: C1[X(C14H23NO2)]
method: RPBEPBE
basis: SDD
operation: Freq
keyword: #p
keyword: freq=noraman
keyword: PBEPBE/SDD
title: #p freq=noraman PBEPBE/SDD
converged: YES YES NO NO
title: Mulliken charges:
elementType: O O N C C C C C C C C C C C C C C H H H H H H H H H H H H H H H H H H H H H H H
charge: -0.337239 -0.455550 -0.310492 -0.118930 -0.413939 -0.275243 -0.054780 -0.095033 0.454879 -0.682750 -0.699370 -0.707899 -0.437893 -0.388221 -0.223495 -0.223666 -0.240883 0.208287 0.216144 0.225205 0.226322 0.199518 0.207668 0.237176 0.196474 0.210961 0.200124 0.232348 0.233261 0.207179 0.197689 0.231505 0.234555 0.226845 0.353422 0.229574 0.258445 0.225446 0.224603 0.227753
chargesum: 0.00000
title: Mulliken charges with hydrogens summed into heavy atoms:
elementType: O O N C C C C C C C C C C C C C C
charge: -0.337239 -0.102127 -0.073316 0.089357 0.027411 0.150597 0.152887 0.101441 0.454879 -0.039317 -0.061241 -0.014994 -0.208319 -0.129775 0.001951 0.000937 -0.013130
polarizability: 2.02372526e+02 -2.32181277e+00 1.52656860e+02 7.87983627e+00 -1.68854596e+01 1.35025728e+02
1716.lowfreq: -3.4051 -0.0008 -0.0006 -0.0004 3.9554 9.0511 14.1706 19.8084 26.4383
frequency: 12.0836 19.2300 26.0803 33.4746 62.6591 70.8596 106.8816 139.3164 148.6415 170.6405 198.0069 216.5649 240.0873 250.5244 260.3971 279.9660 303.1607 320.2790 325.6114 380.5515 401.6303 419.1933 452.2191 459.8889 504.3227 522.3504 533.5798 594.1894 615.6397 634.7478 676.2003 705.1996 766.2243 773.0746 819.3757 842.1952 855.7408 860.4728 909.3858 918.4825 921.4048 926.2169 937.7834 957.0582 978.9610 989.4895 995.9822 998.3128 1007.0865 1026.7073 1063.9514 1068.2806 1071.2058 1096.2803 1102.1230 1106.4683 1130.1140 1153.4649 1171.9398 1175.3410 1184.3390 1211.4900 1215.5575 1228.1816 1247.6152 1299.1394 1301.1601 1309.7970 1316.8208 1332.6273 1337.9557 1356.9779 1366.2373 1373.7461 1381.4903 1382.1552 1387.1055 1387.8351 1439.5127 1447.1982 1458.6463 1463.5728 1464.1653 1466.8835 1470.2616 1480.5276 1483.8024 1484.5439 1485.6267 1594.9226 1616.2441 2926.4980 2928.9309 2957.3786 2966.4299 2972.4994 2979.0837 2986.5195 3017.2763 3036.7441 3039.9159 3059.9319 3070.1200 3073.5932 3084.0935 3092.6845 3094.3572 3112.6090 3125.4546 3139.0670 3154.6857 3166.2242 3411.6437 3484.4877
redmass: 3.7107 4.3511 2.7248 3.4904 4.9905 3.7060 3.4966 3.8255 3.5536 2.6145 2.4534 1.0468 1.2643 1.7533 1.4084 3.1445 3.3944 3.4252 3.7535 2.4354 2.8308 2.4101 2.3042 2.8998 2.9283 1.1687 2.9642 3.7222 6.0004 2.8663 1.6250 1.7708 2.0491 2.6183 2.4674 2.9400 1.3005 2.3237 1.2551 1.7747 1.5014 2.0713 1.5405 2.5471 1.3858 5.7845 1.3285 1.9756 2.5838 2.1394 2.0529 1.9363 1.9768 1.9939 2.7183 2.0656 2.1212 1.5310 1.0550 2.0554 1.1109 1.8960 1.4324 1.4506 1.3473 1.5445 1.2398 1.4033 1.2455 1.3115 1.2964 1.3950 1.3307 1.3185 1.2681 1.3876 2.5000 1.5360 2.1417 1.1682 1.0769 1.0549 1.0493 1.0790 1.0867 1.0781 1.0598 1.0837 2.1120 6.1618 6.1525 1.0671 1.0840 1.0590 1.0357 1.0450 1.0760 1.0351 1.0867 1.0923 1.1031 1.0987 1.0973 1.0995 1.0997 1.1001 1.1005 1.0874 1.0865 1.0924 1.0959 1.0999 1.0736 1.0646
irintensity: 0.1833 0.1177 0.1709 0.2795 1.2142 0.3209 1.5882 3.4926 0.1370 7.6762 2.8602 0.3630 0.8271 1.5261 1.4824 1.6493 1.1488 4.5752 0.4772 0.5358 0.4400 0.3037 1.5362 5.4121 28.0723 117.5581 22.6354 4.4978 1.2465 13.4430 83.1694 51.8984 44.6062 9.3751 2.2074 13.8390 0.7486 6.0053 3.0390 4.1729 0.2034 22.6617 1.9552 36.5105 0.5167 0.9557 1.6983 19.0498 40.4363 26.7984 105.1723 60.9812 15.5580 9.2445 37.3366 31.7255 14.7967 27.8383 0.2099 76.3723 0.9330 6.7424 24.9666 9.4742 11.5404 8.5268 20.4284 11.2979 9.0000 3.8610 3.0145 13.5532 9.8960 39.2428 43.2793 5.6667 15.2740 15.1542 13.5454 20.1984 9.4802 6.0357 2.3538 3.6876 19.7057 6.5632 15.0148 10.6055 13.7379 0.9671 3.4503 61.6679 41.7638 46.0043 28.9475 19.3261 33.6698 17.5524 15.4520 57.4359 29.0112 5.9967 86.9341 39.1358 43.0076 40.7634 20.0106 9.8889 0.5685 27.3619 34.4947 12.9262 2.1091 37.0057
temp: 298.150 k
press: 1.00000 atm
elementType: 8 8 7 6 6 6 6 6 6 6 6 6 6 6 6 6 6 1 1 1 1 1 1 1 1 1 1 1 1 1 1 1 1 1 1 1 1 1 1 1
symmnumber: 1
zpe: 906552.0 jmol-1
zpe.correction: 0.345287 hartree
zpe.thermalcorrener: 0.364361 hartree
zpe.thermalcorrenthalpy: 0.365305 hartree
zpe.thermalcorrgfe: 0.294661 hartree
zpe.sumelectzpe: -751.119288 hartree
zpe.sumelectthermal: -751.100214 hartree
zpe.sumelectthermalent: -751.099270 hartree
zpe.sumelectthermalfe: -751.169915 hartree
dipole: 0.1645 0.8528 2.3749
dipole: 2.5288
quadrupole: -90.4469 -102.6352 -110.6444
quadrupole: 1.7336 0.3085 -10.1163
quadrupole: 10.7953 -1.3931 -9.4022 1.7336 0.3085 -10.1163
hfenergy: -751.4645756 hartree
pointgroup: C01 [X(C14H23N1O2)]
dipole: 0.0099847 0.4997706 0.8601919 debye
polarizability: 201.5785154|2.3702167|146.1819057|11.2607059|-18.4422923|142.2946927 unknown
InChI: InChI=1S/C14H23NO2/c1-11(2)15-9-14(16)10-17-12(3)13-7-5-4-6-8-13/h4-8,11-12,14-16H,9-10H2,1-3H3
charge 0 multiplicity 1
40 atoms
O  -0.180023 -0.797616 0.207189
O  1.168255 -2.354853 -1.578199
N  3.562564 -0.079129 0.246891
C  1.900038 -1.803545 -0.430421
C  2.633795 -0.497826 -0.826351
C  0.939858 -1.593993 0.751088
C  3.996288 1.344083 0.239351
C  -1.399232 -0.801394 1.040895
C  -2.504829 -0.142762 0.225598
C  4.805009 1.751688 -1.023865
C  4.797099 1.627484 1.526598
C  -1.161712 -0.063953 2.379888
C  -3.845113 -0.578583 0.366615
C  -2.219978 0.944122 -0.638071
C  -4.88859 0.065305 -0.33637
C  -3.261285 1.584571 -1.346111
C  -4.599343 1.1509 -1.194995
H  2.646108 -2.573761 -0.157232
H  1.882107 0.30312 -0.964642
H  3.115681 -0.674988 -1.814122
H  1.461753 -1.052493 1.562619
H  0.556175 -2.57007 1.116307
H  3.067653 1.95045 0.265277
H  4.376044 -0.709525 0.314238
H  -1.677382 -1.858761 1.253144
H  5.04305 2.832054 -1.011875
H  5.759857 1.192318 -1.069071
H  4.237922 1.538791 -1.948293
H  4.195826 1.374928 2.417075
H  5.091628 2.690932 1.584184
H  5.723861 1.0206 1.553308
H  -2.097095 -0.029577 2.966616
H  -0.837398 0.973701 2.186424
H  -0.391317 -0.569683 2.988994
H  0.302724 -1.86247 -1.603357
H  -4.075185 -1.427489 1.023304
H  -1.181259 1.266361 -0.76153
H  -5.921077 -0.283316 -0.220631
H  -3.030211 2.420216 -2.016704
H  -5.406266 1.648963 -1.744265
