program: Gaussian 09
title: 000214452
version: EM64L-G09RevD.01
frameworkgroup: C1[X(C16H11Cl2N3O)]
method: RPBEPBE
basis: SDD
operation: Freq
keyword: #p
keyword: freq=noraman
keyword: PBEPBE/SDD
title: #p freq=noraman PBEPBE/SDD
converged: YES YES NO NO
title: Mulliken charges:
elementType: Cl Cl O N N N C C C C C C C C C C C C C C C C H H H H H H H H H H H
charge: 0.033140 -0.011807 -0.193010 -0.348136 -0.389652 -0.028214 0.560002 0.141622 0.070659 -0.578358 0.103734 0.412973 0.062411 0.353399 0.398868 -0.582317 -0.815969 -0.297356 -0.808824 -0.412850 -0.257882 -0.192330 0.347940 0.252703 0.252723 0.213222 0.276974 0.252003 0.216073 0.251988 0.239114 0.240021 0.237137
chargesum: 0.00000
title: Mulliken charges with hydrogens summed into heavy atoms:
elementType: Cl Cl O N N N C C C C C C C C C C C C C C C C
charge: 0.033140 -0.011807 -0.193010 -0.348136 -0.041713 -0.028214 0.560002 0.141622 0.070659 -0.578358 0.103734 0.412973 0.062411 0.353399 0.398868 -0.582317 -0.097321 -0.020382 -0.088760 -0.173736 -0.017862 0.044807
polarizability: 3.86268865e+02 -1.56020991e+00 2.46267395e+02 1.84350570e-02 2.44666409e-02 8.78701829e+01
1716.lowfreq: -102.1094 -34.6526 -5.2494 -4.1462 -2.4219 0.0008 0.0014 0.0016 39.4614
frequency: -102.0984 -34.6442 39.4478 57.2432 87.1098 116.3549 119.8451 129.2013 154.3338 191.2086 214.5130 215.0146 266.6866 282.0514 282.5813 290.4389 312.9250 346.9108 375.0996 393.8878 406.6343 437.7778 445.0642 467.6428 499.4878 527.5349 537.3133 544.8965 589.3680 603.0379 612.9214 649.8645 662.5944 671.1032 673.5364 693.7293 762.9453 769.3663 781.8864 812.7076 820.4297 832.3344 874.6829 878.5365 905.1385 972.5350 996.8453 1001.4818 1020.4864 1027.8073 1031.5148 1051.1038 1055.0834 1058.9373 1113.4925 1144.0524 1172.9986 1199.0173 1235.9307 1245.0284 1271.9383 1282.0798 1351.2141 1362.0857 1375.5656 1393.6357 1399.7272 1413.7396 1424.9030 1428.4750 1457.9914 1460.2363 1469.9788 1473.4781 1479.4512 1491.5052 1550.9631 1584.7673 1600.2895 1615.6499 1634.5469 1658.3934 2994.8259 2997.8006 3064.7123 3066.0259 3127.5782 3132.5202 3140.7178 3149.5729 3160.6197 3177.5187 3563.1674
redmass: 1.0860 10.1631 5.2594 3.2262 1.8536 5.3087 8.1892 1.6857 5.1098 12.8217 14.2941 7.3385 6.3765 4.5848 4.9460 5.1381 17.7163 7.9181 7.3674 5.6601 2.8363 3.7131 7.1107 6.0129 8.6888 3.3518 7.9945 8.6440 3.9661 4.5916 1.5478 4.2662 6.1658 6.0610 4.6612 7.3833 2.4164 6.9366 1.8496 7.4641 9.3350 4.6554 1.4779 5.7114 8.7288 1.3646 1.9189 1.3345 1.8264 1.4075 2.1941 8.3590 1.6347 3.1790 2.1757 3.9921 1.0950 3.2248 5.2474 2.1575 3.8415 2.7475 8.4743 3.1901 6.1761 1.2234 6.2372 1.2265 5.4846 2.2885 1.1277 1.0428 2.5917 1.0440 1.4555 2.6247 4.3570 8.4183 8.0589 9.8921 7.4508 8.5477 1.0402 1.0414 1.0970 1.0970 1.0976 1.0877 1.0914 1.0901 1.0938 1.1001 1.0776
irintensity: 0.1591 1.8010 2.0418 0.1210 1.7249 0.0091 2.3496 0.1802 0.8466 0.1281 1.4721 0.0430 3.1228 0.5612 8.2055 4.3339 2.1396 4.0500 2.2859 2.4703 1.2392 2.0395 4.8418 5.4602 5.4583 15.9720 4.3808 2.3186 19.6451 2.5671 55.2325 0.4690 9.5005 3.5160 0.4121 22.1699 69.4957 39.2366 42.2694 0.0019 34.4069 7.6719 1.2789 5.7614 10.4546 2.7757 24.9378 0.2543 95.2883 7.3880 16.1485 41.6545 0.0033 37.4470 9.3966 74.8230 7.8421 18.5054 41.9605 42.0719 84.4122 39.0685 25.1312 24.5731 24.9646 10.9874 4.3650 9.7536 20.8841 11.1937 17.5332 0.0028 5.9735 24.5187 24.1529 67.1940 73.8231 211.1179 177.1136 144.2057 385.0760 311.9014 8.9619 32.7608 4.6769 18.5151 7.6707 4.1579 43.3768 9.9841 5.4779 21.9438 81.2298
temp: 298.150 k
press: 1.00000 atm
elementType: 17 17 8 7 7 7 6 6 6 6 6 6 6 6 6 6 6 6 6 6 6 6 1 1 1 1 1 1 1 1 1 1 1
symmnumber: 1
zpe: 618573.3 jmol-1
zpe.correction: 0.235602 hartree
zpe.thermalcorrener: 0.252657 hartree
zpe.thermalcorrenthalpy: 0.253601 hartree
zpe.thermalcorrgfe: 0.190688 hartree
zpe.sumelectzpe: -1774.421055 hartree
zpe.sumelectthermal: -1774.404000 hartree
zpe.sumelectthermalent: -1774.403056 hartree
zpe.sumelectthermalfe: -1774.465970 hartree
dipole: -3.0003 -1.7372 0.0009
dipole: 3.4670
quadrupole: -103.7927 -145.0363 -143.6925
quadrupole: 16.7197 0.0146 -0.0021
quadrupole: 27.0478 -14.1958 -12.8520 16.7197 0.0146 -0.0021
hfenergy: -1774.6566572 hartree
pointgroup: C01 [X(C16H11Cl2N3O1)]
dipole: 1.1991525 -0.6497052 -0.0205246 debye
polarizability: 386.0699201|5.4687099|246.2832006|0.6897975|5.3737533|88.053322 unknown
InChI: InChI=1S/C16H11Cl2N3O/c1-7-8(2)12(18)14-13(11(7)17)20-16-19-10-6-4-3-5-9(10)15(22)21(14)16/h3-6,19H,1-2H3
charge 0 multiplicity 1
33 atoms
Cl -1.51372 3.153036 0.104781
Cl -3.480712 -2.994088 -0.110924
O  1.291212 2.383276 0.07706
N  0.370368 0.197234 0.004873
N  1.872949 -1.7196 -0.057767
N  -0.511228 -1.953153 -0.069262
C  -1.064326 0.344566 0.007508
C  -1.556412 -1.01082 -0.039367
C  0.592597 -1.212326 -0.042382
C  -2.000252 1.402287 0.041634
C  1.463932 1.142348 0.037231
C  -3.402199 1.138886 0.028907
C  2.811547 0.512973 0.018467
C  -3.885443 -0.214671 -0.018014
C  3.002174 -0.89998 -0.028812
C  -2.937328 -1.260926 -0.050891
C  -4.352455 2.325473 0.065667
C  3.950725 1.359603 0.04822
C  -5.358894 -0.584196 -0.033765
C  4.310399 -1.449376 -0.045881
C  5.246979 0.820076 0.031619
C  5.421235 -0.589694 -0.015706
H  1.950701 -2.737202 -0.091716
H  -4.185307 2.935268 0.971805
H  -4.178136 2.995188 -0.795704
H  -5.407491 2.02296 0.051027
H  3.777221 2.439775 0.084028
H  -5.603211 -1.231896 0.827826
H  -6.026408 0.286427 -0.003462
H  -5.600478 -1.168446 -0.94035
H  4.44767 -2.535943 -0.082281
H  6.119333 1.479876 0.054799
H  6.430659 -1.014435 -0.028872
