program: Gaussian 09
title: 000214436
version: EM64L-G09RevD.01
frameworkgroup: C1[X(C18H18N2O)]
method: RPBEPBE
basis: SDD
operation: Freq
keyword: #p
keyword: freq=noraman
keyword: PBEPBE/SDD
title: #p freq=noraman PBEPBE/SDD
converged: YES YES NO NO
title: Mulliken charges:
elementType: O N N C C C C C C C C C C C C C C C C C C H H H H H H H H H H H H H H H H H H
charge: -0.262958 -0.118444 -0.292419 -0.509932 0.134167 -0.015860 0.192135 -0.363445 0.302751 0.321909 -0.391913 -0.378157 -0.399402 -0.387968 -0.234613 -0.234321 -0.239315 -0.239564 -0.623542 -0.245733 -0.246787 0.256269 0.222995 0.218238 0.220351 0.253833 0.264318 0.255622 0.258265 0.264772 0.230868 0.228766 0.227976 0.226317 0.194584 0.223077 0.227659 0.230975 0.228525
chargesum: 0.00000
title: Mulliken charges with hydrogens summed into heavy atoms:
elementType: O N N C C C C C C C C C C C C C C C C C C
charge: -0.262958 -0.118444 -0.038585 -0.030668 0.134167 -0.015860 0.192135 0.075144 0.302751 0.321909 -0.127596 -0.122535 -0.141137 -0.123196 -0.003746 -0.005554 -0.011338 -0.013247 0.021779 -0.014759 -0.018262
polarizability: 2.80001472e+02 1.10812815e+01 2.76042497e+02 -1.48763309e+01 -1.52081238e+01 1.22541322e+02
1716.lowfreq: -6.6599 -2.9497 0.0002 0.0005 0.0007 3.4149 5.9201 30.3086 41.5472
frequency: -6.2329 30.1601 41.5413 46.7364 65.5376 77.7961 94.1297 104.1398 129.8663 137.2275 205.8498 233.5112 236.7784 243.7447 259.9245 291.9723 332.6608 358.2359 401.2265 407.6101 411.1655 433.3816 494.3189 518.6071 575.5595 614.3394 615.7694 648.8892 661.5657 665.5323 691.7151 697.3868 701.8917 704.8903 770.0121 771.6733 780.0485 791.2613 850.5145 860.1218 906.9891 926.2104 933.8415 940.2913 966.3725 979.1635 985.5112 987.7391 989.0097 993.9069 996.6724 999.3536 1019.3942 1027.1909 1030.8726 1039.6492 1077.9767 1082.8996 1100.9741 1120.8968 1125.5277 1165.8563 1168.3330 1172.6854 1174.3420 1189.6237 1194.9158 1203.0997 1239.6820 1283.2249 1308.9662 1318.6758 1323.5960 1357.4449 1368.7306 1377.4471 1379.3820 1435.1658 1437.0215 1438.4452 1450.0631 1456.4518 1467.6192 1468.0072 1488.8855 1494.8915 1498.6692 1544.4076 1573.1332 1583.7010 1587.3685 1614.6785 1617.3074 2880.0487 2901.0162 2978.0413 3016.0233 3018.6637 3076.7091 3082.4494 3124.6636 3128.3664 3134.7695 3138.1734 3148.7887 3153.0283 3159.1390 3162.0914 3169.1432 3171.3013 3440.2096
redmass: 3.2257 3.6581 4.6460 4.4533 1.8289 4.4966 2.9376 3.9027 6.4546 3.3690 2.8462 4.1554 1.5448 5.3888 3.1661 5.1321 3.9857 5.1582 2.8296 2.8918 5.6189 3.7378 3.6475 4.3229 4.7734 6.4326 6.4469 3.7889 1.8549 6.3412 3.5400 1.9503 4.5200 1.8097 1.7770 5.2818 2.0775 1.2977 1.2502 1.2457 6.7349 1.4505 1.4280 7.0507 2.2036 1.3856 1.4218 5.8682 5.7663 4.9290 1.3394 1.3107 2.0763 2.4053 2.8517 2.2507 1.7271 1.6742 1.4117 1.8929 3.4299 2.7753 2.2194 1.0628 1.0603 1.1311 1.1287 3.5646 1.6008 1.1094 1.6218 1.4250 1.3654 3.0669 1.4613 6.2183 7.0739 2.3481 1.1466 2.3273 1.2037 1.1019 2.1656 1.0806 1.0619 2.7539 1.0672 9.9033 6.8472 6.1556 7.2559 6.1389 6.2246 1.0556 1.0694 1.0681 1.0769 1.0881 1.0996 1.0941 1.0847 1.0849 1.0885 1.0887 1.0933 1.0931 1.0963 1.0958 1.1001 1.1009 1.0743
irintensity: 0.8669 0.2686 0.2493 0.3165 2.6873 0.0274 2.1626 2.4755 0.5710 0.7280 1.9204 0.4585 1.0872 0.2267 3.1609 0.6801 2.0184 1.9422 0.2055 0.1513 0.7601 5.9654 2.8337 11.4847 16.4215 0.0180 0.1180 17.1173 64.8967 25.6442 44.6442 66.1675 7.6855 12.5997 92.3233 9.3967 15.6202 5.3591 2.0553 0.1800 8.1619 9.3189 1.9465 27.9094 7.2477 2.0504 1.2094 1.1985 0.7764 17.6479 0.5403 0.3385 24.4040 1.6780 1.1829 14.5347 24.5852 1.5089 13.3557 28.7381 3.8420 48.2668 3.4012 0.0565 0.0326 3.2888 0.1048 12.1658 2.6351 3.6033 8.9566 1.9367 0.8266 10.6865 17.0049 0.3062 4.8138 13.6971 2.9469 6.9891 22.2809 15.1824 11.9796 9.2539 14.8877 22.1153 10.6833 64.0455 4.1419 2.3043 0.1366 10.3568 9.9750 135.5186 75.1719 17.0170 61.0967 17.7922 41.8079 9.4208 1.1111 1.2944 8.2406 7.3100 39.8687 22.5124 15.4156 17.4581 19.6513 14.3937 1.3339
temp: 298.150 k
press: 1.00000 atm
elementType: 8 7 7 6 6 6 6 6 6 6 6 6 6 6 6 6 6 6 6 6 6 1 1 1 1 1 1 1 1 1 1 1 1 1 1 1 1 1 1
symmnumber: 1
zpe: 828128.0 jmol-1
zpe.correction: 0.315417 hartree
zpe.thermalcorrener: 0.333390 hartree
zpe.thermalcorrenthalpy: 0.334334 hartree
zpe.thermalcorrgfe: 0.267744 hartree
zpe.sumelectzpe: -879.933060 hartree
zpe.sumelectthermal: -879.915087 hartree
zpe.sumelectthermalent: -879.914143 hartree
zpe.sumelectthermalfe: -879.980733 hartree
dipole: -0.1781 0.0266 -0.0464
dipole: 0.1859
quadrupole: -102.7460 -116.7803 -123.6106
quadrupole: 3.8178 -4.1543 -3.8509
quadrupole: 11.6329 -2.4013 -9.2316 3.8178 -4.1543 -3.8509
hfenergy: -880.2484769 hartree
pointgroup: C01 [X(C18H18N2O1)]
dipole: -0.0711409 0.0055468 0.0161005 debye
polarizability: 274.1611462|-10.2393433|280.973424|15.6883412|-18.9079095|123.4507206 unknown
InChI: InChI=1S/C18H18N2O/c1-19-13-12-16-20-17(14-8-4-2-5-9-14)18(21-16)15-10-6-3-7-11-15/h2-11,19H,12-13H2,1H3
charge 0 multiplicity 1
39 atoms
O  1.269684 1.322306 0.294799
N  1.227434 -0.950208 0.430223
N  5.726871 -0.575266 0.161696
C  3.465304 0.235141 0.755086
C  -0.082941 0.91074 0.090986
C  -0.092693 -0.488581 0.149069
C  1.996574 0.125288 0.50336
C  4.293159 -0.697535 -0.164446
C  -1.05813 1.996476 -0.044333
C  -1.16686 -1.474678 -0.074947
C  -2.409361 1.833527 0.373583
C  -0.648326 3.259409 -0.559553
C  -2.277647 -1.210334 -0.922724
C  -1.063099 -2.754669 0.536375
C  -3.326311 2.897927 0.257002
C  -1.569354 4.321011 -0.670828
C  -3.270665 -2.190816 -1.12863
C  -2.059262 -3.731711 0.33138
C  6.627962 -1.297316 -0.756822
C  -2.914342 4.145478 -0.269023
C  -3.171497 -3.453554 -0.497625
H  3.78957 1.278643 0.607305
H  3.674789 -0.025109 1.81289
H  4.153453 -0.387735 -1.218037
H  3.896411 -1.737365 -0.078434
H  5.910137 -0.813852 1.146018
H  -2.733811 0.88196 0.806202
H  0.393099 3.397591 -0.86668
H  -2.353556 -0.247651 -1.438776
H  -0.18921 -2.966206 1.160381
H  -4.361176 2.756967 0.588027
H  -1.238241 5.285383 -1.071776
H  -4.11678 -1.973467 -1.790238
H  -1.967128 -4.710938 0.814508
H  6.417747 -2.391097 -0.846735
H  7.673577 -1.173803 -0.42357
H  6.548247 -0.85981 -1.769322
H  -3.629474 4.970688 -0.357029
H  -3.944847 -4.212934 -0.658563
