program: Gaussian 09
title: 000214479
version: EM64L-G09RevD.01
frameworkgroup: C1[X(C26H32N2)]
method: RPBEPBE
basis: SDD
operation: Freq
keyword: #pfreq=noraman
keyword: PBEPBE/SDD
title: #p freq=noraman PBEPBE/SDD
converged: YES YES NO NO
title: Mulliken charges:
elementType: N N C C C C C C C C C C C C C C C C C C C C C C C C C C H H H H H H H H H H H H H H H H H H H H H H H H H H H H H H H H
charge: -0.097192 -0.070278 -0.009091 -0.427659 -0.426863 -0.387973 -0.366068 -0.419589 -0.358698 -0.390894 -0.336485 -0.485938 -0.327270 0.155021 0.164620 0.182769 0.288030 0.340748 -0.548328 -0.622978 -0.402459 -0.390386 -0.367588 -0.441720 -0.256949 -0.259020 -0.255954 -0.236832 0.196630 0.206069 0.179628 0.189760 0.200407 0.186995 0.203079 0.208662 0.168377 0.192501 0.213532 0.184887 0.195530 0.204599 0.191348 0.173169 0.215065 0.199739 0.257139 0.232768 0.219149 0.237450 0.210927 0.225056 0.250183 0.242181 0.230247 0.235448 0.226580 0.226768 0.226776 0.224377
chargesum: 0.00000
title: Mulliken charges with hydrogens summed into heavy atoms:
elementType: N N C C C C C C C C C C C C C C C C C C C C C C C C C C
charge: -0.097192 -0.070278 0.187538 -0.037492 -0.041166 0.002100 0.010971 -0.013556 0.021719 0.005053 0.051749 -0.029061 -0.094502 0.155021 0.164620 0.182769 0.288030 0.340748 -0.091729 -0.186995 -0.152277 -0.148205 -0.137341 -0.206272 -0.030369 -0.032253 -0.029178 -0.012456
polarizability: 3.42521412e+02 -2.34758405e+01 2.87470251e+02 2.77717784e+01 1.06001948e+01 2.48973444e+02
1716.lowfreq: -15.1350 -6.1775 -3.7964 -0.0009 -0.0002 0.0008 4.6384 15.0374 25.1562
frequency: -12.1472 14.0931 24.7948 41.8963 49.1631 72.1757 94.2925 110.8986 123.4935 136.3404 142.8912 156.4146 182.3038 192.6239 211.4767 241.7163 253.8394 271.2292 303.4021 309.2195 319.5760 330.2604 340.8862 362.2641 372.4224 400.7239 422.3828 428.2785 436.3759 454.3529 463.3876 476.6758 487.2823 501.8398 530.3430 533.8780 555.3244 583.8007 590.7984 618.4002 629.1101 658.7825 680.6073 719.6189 720.6075 743.0253 761.9158 767.3646 772.1531 775.5837 796.8893 801.0739 819.2656 851.4859 861.5298 866.8805 873.2016 879.8791 891.6087 893.7402 920.2622 923.7921 947.1679 951.7966 970.9470 972.3837 984.1419 986.3244 988.4008 1004.1785 1015.9672 1031.7061 1036.1231 1039.2094 1052.6922 1057.6059 1069.7545 1075.7311 1085.9864 1101.9339 1106.9032 1112.6532 1123.1452 1130.3690 1138.0231 1138.5902 1149.2015 1163.9906 1166.0432 1172.9773 1175.1194 1178.8819 1192.3198 1195.7921 1214.7384 1217.8160 1223.0631 1229.8263 1243.2230 1253.6460 1265.3592 1266.1728 1277.0495 1283.6257 1285.7030 1291.3748 1292.7472 1307.2698 1326.5842 1333.2460 1336.2304 1341.2558 1344.5869 1348.6759 1353.6087 1356.0360 1358.2991 1360.4995 1375.9312 1377.0927 1391.5061 1393.8283 1427.4512 1439.3993 1446.3139 1447.9627 1451.7733 1455.2721 1458.5763 1460.5119 1461.9845 1468.0527 1470.7355 1476.5483 1479.2312 1480.6251 1483.4173 1575.5429 1582.7056 1603.5990 1609.6353 1634.5942 2816.8507 2825.4078 2828.2131 2845.9700 2852.9849 2866.1664 2954.3134 2959.0506 2967.6213 2976.5045 2983.3820 2985.1670 3012.5659 3016.1994 3017.8751 3021.0878 3024.7669 3032.1894 3039.5729 3040.4907 3045.0812 3052.2008 3060.7933 3078.2480 3107.8687 3115.2024 3125.7189 3126.0734 3140.0690 3140.9833 3159.3637 3159.7355
redmass: 3.4710 3.9165 4.5459 4.4004 4.2749 4.0499 3.6148 2.6446 3.7924 2.8661 2.8702 3.8844 2.7190 3.4861 2.3209 2.1435 3.3530 3.4576 1.9914 4.4987 2.3162 2.8609 3.3277 2.1320 3.4406 3.0352 3.5833 3.5520 3.2905 3.0035 3.0586 3.6500 3.1464 2.5476 3.6098 3.5367 2.3976 3.0301 2.9647 2.5723 5.1442 4.5612 4.5293 3.0549 3.2226 2.0875 1.5916 1.6477 2.3419 1.8412 2.2689 3.0183 1.5229 1.7787 1.7050 1.6233 1.7422 1.4557 1.5393 2.3420 2.6410 2.4650 1.4971 1.3992 1.6011 2.1760 1.3317 1.3285 2.1636 2.1658 2.0461 2.7972 3.1745 2.3135 2.0238 2.2560 2.0338 2.3744 2.2974 1.7990 2.1516 2.1417 2.1463 2.3593 2.1909 2.3598 2.6647 1.7924 1.3092 1.0718 1.1171 1.5138 1.7323 1.4585 1.2982 1.8113 1.5338 1.5387 1.3128 1.6379 1.2650 1.2843 1.2599 1.3248 1.4117 1.4399 1.4767 1.3736 1.5493 1.3020 1.3687 1.3702 1.3706 1.3715 2.2786 1.6955 1.7006 1.4293 3.2555 4.1521 1.5101 1.4430 2.2255 2.2720 1.0864 1.1744 1.0880 1.0882 1.0947 1.0809 1.0922 1.0987 1.1308 1.0945 1.1014 2.4106 2.5068 6.5096 6.7516 6.0686 6.4501 8.2028 1.0749 1.0721 1.0721 1.0720 1.0700 1.0687 1.0675 1.0613 1.0616 1.0610 1.0637 1.0621 1.0957 1.0877 1.0869 1.0890 1.0893 1.0955 1.1001 1.0897 1.1012 1.1036 1.0915 1.0898 1.0874 1.0865 1.0869 1.0879 1.0940 1.0933 1.1007 1.1008
irintensity: 0.0063 0.0120 0.0444 0.0825 0.0628 0.1066 0.3482 1.2874 0.0936 0.2145 0.6219 2.2581 0.3360 1.6100 2.5990 0.1333 2.5041 0.4054 7.1923 1.9163 0.8217 0.5401 0.2853 1.8053 2.5980 0.8980 0.3452 5.7107 0.6787 4.3757 0.7814 2.4745 1.5636 4.9200 2.2234 0.3722 4.0131 2.6815 10.0076 5.3908 8.5442 0.5076 2.0506 1.6014 7.3679 16.6198 41.5629 21.4403 11.1070 72.5963 1.4561 3.0915 0.6844 8.2726 1.1417 0.8680 9.6227 0.9104 1.4912 9.0116 1.6672 12.6185 0.3295 4.8818 0.7229 2.9460 0.0768 0.2280 2.1885 30.1140 1.3762 6.6314 6.8363 1.6039 46.1569 1.3323 7.6479 17.6783 5.2386 5.8717 2.6857 2.1960 23.3511 51.3813 25.9690 4.0266 31.2846 0.5578 3.4657 0.8900 0.2668 17.8291 0.7117 1.4561 9.4635 1.4828 1.6154 2.2006 1.0980 1.4503 4.0422 1.1579 1.2852 0.9911 4.4146 10.7832 17.4723 20.6255 0.9798 15.6905 0.0911 32.3478 5.1866 3.4010 0.5342 0.2680 5.3357 6.3529 7.0005 3.8816 3.6174 0.9373 9.4908 1.9698 0.3907 12.0729 6.9611 11.9103 8.0506 1.9614 7.1844 7.8011 10.2843 14.5242 2.7205 10.8089 26.2598 1.4770 0.8221 1.2508 1.5130 3.1050 37.6963 114.7144 19.1054 54.8157 39.4544 262.6995 18.5463 26.3882 39.7994 34.6910 19.5605 33.5804 41.9404 31.0532 10.0575 81.6111 24.8525 70.0637 41.5312 54.5686 29.5253 82.7512 7.6331 32.7904 13.0162 7.5660 3.6939 4.5206 23.7214 33.6141 49.7333 17.6612
temp: 298.150 k
press: 1.00000 atm
elementType: 7 7 6 6 6 6 6 6 6 6 6 6 6 6 6 6 6 6 6 6 6 6 6 6 6 6 6 6 1 1 1 1 1 1 1 1 1 1 1 1 1 1 1 1 1 1 1 1 1 1 1 1 1 1 1 1 1 1 1 1
symmnumber: 1
zpe: 1358997.3 jmol-1
zpe.correction: 0.517615 hartree
zpe.thermalcorrener: 0.541193 hartree
zpe.thermalcorrenthalpy: 0.542137 hartree
zpe.thermalcorrgfe: 0.463868 hartree
zpe.sumelectzpe: -1117.382416 hartree
zpe.sumelectthermal: -1117.358837 hartree
zpe.sumelectthermalent: -1117.357893 hartree
zpe.sumelectthermalfe: -1117.436162 hartree
dipole: -0.4603 0.2593 0.5363
dipole: 0.7528
quadrupole: -162.5243 -163.2711 -158.7050
quadrupole: -2.6469 6.8532 3.4007
quadrupole: -1.0242 -1.7710 2.7951 -2.6469 6.8532 3.4007
hfenergy: -1117.9000305 hartree
pointgroup: C01 [X(C26H32N2)]
dipole: 0.1836436 -0.0615841 0.2240428 debye
polarizability: 343.2294167|-26.8199745|281.8458053|-23.6639172|-16.6612164|253.8898845 unknown
InChI: InChI=1S/C26H32N2/c1-3-11-24-21(8-1)14-15-22-9-2-4-12-25(22)26(24)13-7-16-27-18-19-28-17-6-5-10-23(28)20-27/h1-4,8-9,11-13,23H,5-7,10,14-20H2
charge 0 multiplicity 1
60 atoms
N  5.533531 0.461077 -0.668814
N  2.648367 0.458139 -0.281433
C  4.946804 0.242259 0.68518
C  5.900704 0.77775 1.77513
C  3.574942 0.938342 0.773258
C  4.602929 -0.00317 -1.727005
C  6.86768 -0.175521 -0.812562
C  7.305669 0.146857 1.659331
C  3.244845 0.704634 -1.616697
C  7.86226 0.360956 0.233769
C  1.287552 1.023507 -0.127546
C  0.215095 0.247773 -0.93503
C  -1.159762 0.848029 -0.742512
C  -2.318875 0.197785 -0.404711
C  -3.600597 0.978085 -0.276976
C  -2.365047 -1.291216 -0.22392
C  -4.573862 0.788614 0.755702
C  -2.736537 -1.843056 1.034953
C  -4.47818 -0.21547 1.910049
C  -3.11416 -0.903183 2.164139
C  -3.860998 1.963324 -1.277275
C  -2.042438 -2.1610 -1.296053
C  -5.742183 1.598366 0.744638
C  -2.77329 -3.248827 1.192953
C  -5.023649 2.756301 -1.269365
C  -2.087758 -3.563391 -1.131555
C  -5.979093 2.572632 -0.244191
C  -2.453017 -4.111001 0.119083
H  4.782845 -0.855626 0.856224
H  3.127475 0.719839 1.761167
H  3.739817 2.045341 0.703523
H  5.462885 0.57221 2.771718
H  5.981316 1.877576 1.664223
H  4.432543 -1.108636 -1.665326
H  5.055401 0.218709 -2.712532
H  7.236857 0.031793 -1.835305
H  6.794225 -1.291619 -0.705926
H  7.241018 -0.941152 1.868575
H  7.987817 0.5816 2.414431
H  3.387214 1.800857 -1.801068
H  2.571468 0.310688 -2.398864
H  8.022182 1.442068 0.056101
H  8.837482 -0.148783 0.112268
H  1.254229 2.108493 -0.413948
H  1.020717 0.968561 0.945192
H  0.477761 0.284058 -2.01364
H  0.241631 -0.814124 -0.637007
H  -1.207302 1.943786 -0.847368
H  -4.78333 0.308937 2.837549
H  -5.237537 -1.008167 1.745305
H  -3.179347 -1.464232 3.114995
H  -2.334409 -0.127393 2.294712
H  -3.139666 2.076539 -2.093916
H  -1.770142 -1.729672 -2.266118
H  -6.480477 1.45629 1.54486
H  -3.050944 -3.670255 2.167169
H  -5.189482 3.496234 -2.060269
H  -1.840823 -4.22173 -1.971933
H  -6.894286 3.174544 -0.218851
H  -2.487168 -5.197631 0.257021
