program: Gaussian 09
title: 000214448
version: EM64L-G09RevD.01
frameworkgroup: C1[X(C21H22N2O)]
method: RPBEPBE
basis: SDD
operation: Freq
keyword: #p
keyword: freq=noraman
keyword: PBEPBE/SDD
title: #p freq=noraman PBEPBE/SDD
converged: YES YES NO NO
title: Mulliken charges:
elementType: O N N C C C C C C C C C C C C C C C C C C C C C H H H H H H H H H H H H H H H H H H H H H H
charge: -0.261696 -0.069788 -0.117013 -0.439930 -0.423081 -0.445322 -0.443425 -0.335899 -0.508031 0.183244 0.136888 -0.014369 0.300960 0.320031 -0.391811 -0.378669 -0.388138 -0.399012 -0.234318 -0.234377 -0.239739 -0.239051 -0.245944 -0.247076 0.228764 0.215614 0.228212 0.215367 0.228972 0.216866 0.219530 0.228175 0.219382 0.215923 0.233311 0.251696 0.263944 0.255178 0.264597 0.257674 0.230686 0.228529 0.226111 0.227808 0.230827 0.228399
chargesum: 0.00000
title: Mulliken charges with hydrogens summed into heavy atoms:
elementType: O N N C C C C C C C C C C C C C C C C C C C C C
charge: -0.261696 -0.069788 -0.117013 0.004448 0.020498 0.000517 0.004281 0.099406 -0.023024 0.183244 0.136888 -0.014369 0.300960 0.320031 -0.127868 -0.123491 -0.123542 -0.141338 -0.003633 -0.005848 -0.013628 -0.011242 -0.015117 -0.018676
polarizability: 3.21379478e+02 -1.55492412e+01 2.99192717e+02 1.70918532e+01 -1.55286637e+01 1.49965455e+02
1716.lowfreq: -19.9709 -4.2744 -0.0009 -0.0008 -0.0004 3.1552 6.1674 20.6830 27.4689
frequency: -18.0711 20.3179 27.4662 32.6869 43.8969 47.2319 61.7786 76.5835 96.4892 128.0006 132.7193 139.8919 199.1364 241.1150 243.4042 252.3884 287.7904 351.3878 355.7484 373.6499 401.3875 406.9472 412.1098 435.3255 493.8196 518.9695 573.2074 613.6915 615.8043 618.9190 636.4204 654.8671 665.4646 683.8327 697.3764 701.1554 704.4357 737.0059 768.7711 779.3130 782.1539 789.6525 831.1716 847.8109 850.4706 859.6173 875.9903 902.9732 912.8097 926.0750 932.7893 933.7142 940.9317 979.3372 984.6888 987.5302 988.7594 992.0578 996.6680 998.8013 1013.6737 1015.7913 1027.7943 1030.4172 1036.6622 1062.3907 1067.6709 1078.1185 1082.0560 1093.8981 1125.2731 1155.1158 1171.9029 1172.5345 1174.1447 1189.5523 1191.0692 1195.2817 1204.9540 1217.4168 1243.2156 1250.3633 1281.9583 1289.2085 1297.9274 1305.9826 1317.8094 1318.9869 1319.5655 1323.6397 1357.5757 1362.6938 1377.2257 1379.2212 1435.1395 1438.4833 1451.5784 1463.2570 1467.5648 1469.7377 1471.5669 1477.9044 1487.9426 1495.0083 1541.4667 1573.1853 1583.7545 1587.5626 1614.4960 1617.2800 2914.9039 2986.7886 2994.2705 3002.3572 3004.5055 3019.9079 3036.6745 3054.2429 3068.6015 3074.5123 3088.9326 3089.9691 3124.6029 3127.8882 3134.3775 3137.6522 3148.4994 3152.5589 3158.8119 3161.4612 3168.9723 3170.7932
redmass: 3.6003 3.5375 2.8413 3.3170 2.4556 4.3056 3.7892 4.4076 3.6671 4.6009 3.1534 3.8000 4.0769 4.1882 4.7633 4.0129 5.4049 3.8919 4.3523 2.7414 2.8291 2.8811 3.4716 3.2335 3.6242 4.3826 4.6613 5.7551 6.3706 2.7808 3.0356 4.9047 6.9108 5.2116 1.8944 4.1753 1.8633 2.5247 1.7002 1.9045 1.7824 2.0095 1.8983 2.3638 1.2510 1.2459 3.5925 3.5255 3.9334 1.4532 1.5515 1.5331 6.8926 1.3847 1.4872 5.0735 5.6365 5.0282 1.3264 1.3105 3.2335 2.6907 2.3352 2.8598 2.1842 2.3487 2.0884 1.7788 1.6796 1.8810 3.7142 2.2458 1.2638 1.0634 1.0570 1.1570 1.3047 1.1580 3.1730 1.1645 1.4770 1.4015 1.3148 1.2465 1.2382 1.4128 1.2761 1.4231 1.5541 1.3638 2.7108 1.4630 6.3623 7.5987 2.3488 2.3335 1.0958 1.0817 2.2000 1.0837 1.0860 1.0885 1.0950 2.7581 10.2011 6.8146 6.1642 7.2944 6.1436 6.2350 1.0678 1.0649 1.0642 1.0653 1.0592 1.0641 1.0910 1.1013 1.1003 1.1026 1.0986 1.1050 1.0847 1.0849 1.0885 1.0887 1.0933 1.0931 1.0963 1.0958 1.1001 1.1009
irintensity: 0.4731 0.2505 0.2789 0.2167 0.0503 0.3036 0.5926 0.0920 0.6419 0.3707 0.3778 0.8850 0.8870 1.5753 0.8825 1.7062 0.3224 0.6886 0.3093 4.6571 0.2346 0.1094 1.0734 3.3970 3.1861 10.4325 13.1299 0.6588 0.0906 4.1132 3.7308 6.7224 13.6223 5.9623 75.7873 8.4936 14.3742 23.1098 87.9507 5.7398 22.9178 1.6053 3.5491 8.1196 2.1068 0.3012 12.8471 6.9511 10.1971 9.3144 12.6903 1.7624 29.4144 1.9498 3.4294 3.1905 2.5645 21.9368 0.2081 0.2884 0.2589 18.7930 1.8563 10.7373 10.1192 26.7224 59.2354 31.3172 1.3942 11.5597 1.6385 12.0887 4.4205 0.1291 0.0140 3.6119 8.0407 1.6153 8.0497 4.1009 0.3774 12.2813 5.3062 1.8349 0.8022 6.4611 14.9466 1.9715 12.3561 0.9250 10.5648 21.0685 0.2282 4.0336 13.3290 7.4003 2.7545 1.5075 13.5722 22.9035 11.1953 1.2991 8.7937 23.1971 72.6054 3.7595 2.3753 0.1310 11.6798 9.7328 40.4130 52.9791 46.9249 11.8422 43.6361 52.8374 13.2952 22.1425 0.4033 16.9426 26.6903 106.7899 1.2929 1.3933 8.0393 7.3040 39.2478 22.2107 15.9741 18.3756 20.1714 14.6464
temp: 298.150 k
press: 1.00000 atm
elementType: 8 7 7 6 6 6 6 6 6 6 6 6 6 6 6 6 6 6 6 6 6 6 6 6 1 1 1 1 1 1 1 1 1 1 1 1 1 1 1 1 1 1 1 1 1 1
symmnumber: 1
zpe: 994532.3 jmol-1
zpe.correction: 0.378797 hartree
zpe.thermalcorrener: 0.398993 hartree
zpe.thermalcorrenthalpy: 0.399937 hartree
zpe.thermalcorrgfe: 0.326580 hartree
zpe.sumelectzpe: -996.420719 hartree
zpe.sumelectthermal: -996.400523 hartree
zpe.sumelectthermalent: -996.399579 hartree
zpe.sumelectthermalfe: -996.472936 hartree
dipole: -0.0621 0.1364 0.6017
dipole: 0.6201
quadrupole: -118.3474 -135.0798 -141.8996
quadrupole: -2.8594 1.7049 -4.7700
quadrupole: 13.4282 -3.3042 -10.1240 -2.8594 1.7049 -4.7700
hfenergy: -996.799516 hartree
pointgroup: C01 [X(C21H22N2O1)]
dipole: -0.0282517 0.0475904 0.2376043 debye
polarizability: 315.2296603|-17.8758981|304.7478194|21.9934725|-12.7461679|150.5601699 unknown
InChI: InChI=1S/C21H22N2O/c1-3-9-17(10-4-1)20-21(18-11-5-2-6-12-18)24-19(22-20)13-16-23-14-7-8-15-23/h1-6,9-12H,7-8,13-16H2
charge 0 multiplicity 1
46 atoms
O  -0.229779 -1.6271 -0.38488
N  -4.949047 -0.532713 -0.231492
N  -0.555031 0.625947 -0.44746
C  -5.919106 -0.395196 0.893851
C  -5.497395 0.399713 -1.263601
C  -6.297267 1.122208 0.971203
C  -6.092535 1.634898 -0.492684
C  -3.540589 -0.237598 0.142415
C  -2.563528 -0.889341 -0.874558
C  -1.136746 -0.55664 -0.581382
C  1.03101 -1.008907 -0.122598
C  0.81403 0.374536 -0.13666
C  2.166942 -1.925034 0.012557
C  1.705493 1.512894 0.156614
C  3.483117 -1.531056 -0.360825
C  1.956835 -3.253674 0.480357
C  1.411986 2.781082 -0.416517
C  2.816967 1.402206 1.036845
C  4.55863 -2.435249 -0.246939
C  3.036058 -4.154283 0.589363
C  2.225953 3.89961 -0.141667
C  3.62755 2.523371 1.312161
C  4.343607 -3.749495 0.232022
C  3.341515 3.776161 0.719676
H  -5.491342 -0.793178 1.82963
H  -6.818979 -0.993116 0.650913
H  -6.299801 -0.122104 -1.818299
H  -4.717166 0.683766 -1.990249
H  -5.62388 1.65271 1.6680
H  -7.331313 1.271116 1.328707
H  -7.041833 1.964671 -0.950423
H  -5.398868 2.493436 -0.51792
H  -3.313818 0.851706 0.207279
H  -3.35241 -0.670694 1.141824
H  -2.818968 -0.539976 -1.893071
H  -2.701883 -1.982905 -0.861936
H  3.65764 -0.526295 -0.758066
H  0.944621 -3.569475 0.75196
H  0.536031 2.87033 -1.066555
H  3.034168 0.446054 1.524289
H  5.564201 -2.117427 -0.544053
H  2.857352 -5.172113 0.953374
H  1.98898 4.868292 -0.595913
H  4.476303 2.422022 1.997898
H  5.181677 -4.449805 0.317728
H  3.973215 4.645351 0.934381
