program: Gaussian 09
title: 000214427
version: EM64L-G09RevD.01
frameworkgroup: C1[X(C20H20N2O)]
method: RPBEPBE
basis: SDD
operation: Freq
keyword: #p
keyword: freq=noraman
keyword: PBEPBE/SDD
title: #p freq=noraman PBEPBE/SDD
converged: YES YES NO NO
title: Mulliken charges:
elementType: O N N C C C C C C C C C C C C C C C C C C C C H H H H H H H H H H H H H H H H H H H H
charge: -0.247217 -0.077917 -0.123311 -0.428362 -0.432731 -0.451348 -0.448601 -0.452561 0.216291 0.150644 -0.016242 0.291889 0.320447 -0.391587 -0.376745 -0.388148 -0.398740 -0.234808 -0.234543 -0.239496 -0.239112 -0.245125 -0.246830 0.224119 0.221390 0.258963 0.222091 0.220595 0.227950 0.230876 0.220376 0.213469 0.232286 0.263960 0.261748 0.264220 0.258254 0.230817 0.229148 0.226318 0.228121 0.230894 0.228559
chargesum: 0.00000
title: Mulliken charges with hydrogens summed into heavy atoms:
elementType: O N N C C C C C C C C C C C C C C C C C C C C
charge: -0.247217 -0.077917 -0.123311 0.017147 0.048323 -0.002803 0.002651 -0.006806 0.216291 0.150644 -0.016242 0.291889 0.320447 -0.127627 -0.114997 -0.123928 -0.140486 -0.003991 -0.005395 -0.013178 -0.010992 -0.014231 -0.018271
polarizability: 2.95120737e+02 -5.29202560e+00 2.95008902e+02 1.66342125e+01 -1.56655654e+01 1.39523422e+02
1716.lowfreq: -35.0038 -8.0752 -6.8440 -0.0001 0.0005 0.0006 4.7254 14.4215 29.9009
frequency: -34.4702 13.8751 29.8942 30.6070 40.8556 46.1314 77.2999 93.8924 106.6703 131.5991 147.6202 219.9845 243.0078 260.1217 288.8895 313.0168 349.5395 358.1881 391.4970 400.8369 407.4839 420.0223 493.6623 524.8892 568.5631 613.6753 615.1979 621.1848 630.5607 650.3567 665.4626 692.8065 697.4627 703.1271 706.3465 749.1288 769.9640 780.4153 783.8747 828.4498 835.9082 851.1283 860.8392 875.7747 890.3634 908.8530 927.1612 933.6710 935.0396 939.5491 974.4734 979.7182 986.4316 987.9725 989.2865 996.7776 999.6581 1001.6854 1010.8743 1027.7444 1034.7034 1045.1877 1062.7828 1076.1945 1082.4323 1099.9810 1128.5177 1162.6528 1172.5679 1174.2458 1174.8052 1190.4414 1194.5980 1196.6063 1213.8693 1222.8214 1243.3569 1277.1076 1281.6881 1297.4990 1308.1583 1320.0046 1321.5290 1324.5633 1354.9751 1360.5298 1377.4742 1379.3863 1434.8538 1438.2998 1448.2694 1463.4892 1467.2486 1469.8140 1474.4470 1486.6506 1495.0130 1542.7208 1572.2222 1583.5257 1586.6689 1614.6535 1617.0726 2911.2323 2991.9667 2999.7568 3002.8941 3018.9916 3051.9944 3055.1076 3070.8839 3080.3033 3091.9036 3124.5761 3128.1566 3134.6292 3138.2318 3148.8325 3153.0071 3158.9069 3162.2213 3168.9599 3171.2282
redmass: 1.7994 3.2734 3.4221 3.7660 4.7302 4.4809 4.4276 3.7723 4.5259 6.6366 3.8917 3.8340 5.3007 5.3057 4.9429 2.7284 4.6103 3.4414 2.6658 2.8289 2.8930 4.2545 3.6201 4.5595 4.9671 6.3584 6.2683 2.8026 2.7490 5.4441 6.8847 4.4447 1.8562 3.1563 2.2389 2.1148 1.8992 2.1163 4.9856 1.7304 2.2991 1.2503 1.2458 3.5523 4.0815 3.0573 1.4768 1.7158 1.4506 5.0962 2.9538 1.3858 1.3862 6.0999 6.1025 1.3463 1.3123 6.1719 2.9416 2.2260 2.1581 2.0908 2.3555 1.8222 1.6838 2.2319 3.6562 1.9662 1.0683 1.0660 1.4180 1.1371 1.2589 1.5522 1.3821 1.6272 1.4169 1.4126 1.3359 1.2309 1.2491 1.4193 1.4231 1.3621 1.6869 2.4752 6.3680 7.3720 2.3388 2.3304 1.0857 1.0814 2.1941 1.0826 1.0848 1.0949 2.7554 9.8036 6.9750 6.1820 7.0323 6.1158 6.1958 1.0686 1.0634 1.0651 1.0600 1.0642 1.0924 1.0993 1.1011 1.1026 1.1051 1.0847 1.0849 1.0885 1.0887 1.0933 1.0932 1.0962 1.0958 1.1002 1.1008
irintensity: 0.0364 0.4212 0.1986 0.7912 0.7839 0.4001 0.0725 0.0071 0.8085 0.6285 2.0717 0.6744 0.1888 0.8081 0.4264 0.3763 1.2502 1.9259 2.7796 0.1667 0.1184 0.6330 3.1912 9.5026 8.0906 0.1814 0.0821 6.8089 6.0735 7.1926 14.1698 10.5285 78.9552 9.1598 8.5691 14.1168 94.6208 19.3640 33.3655 6.0465 6.2820 2.1597 0.2024 16.3933 8.7881 0.4468 8.1049 18.9193 8.8217 19.1231 15.1570 2.2883 0.3017 0.1460 0.2503 0.6452 0.0773 31.0324 21.8032 1.8994 1.9113 28.9366 19.8384 13.2146 4.0861 7.9393 2.0899 3.6104 0.1139 0.0861 2.5119 3.4606 2.2395 4.7745 4.5423 3.8896 6.5765 13.7864 6.0475 0.6053 2.1355 2.0772 8.6737 1.1576 16.9624 5.5974 0.5470 1.6041 14.4334 6.9919 7.9975 0.5199 14.4923 13.3249 7.6765 11.8867 17.7360 20.0935 0.5401 1.4644 1.1710 6.4398 9.5200 52.1809 41.5100 38.9413 40.4546 53.3317 1.8203 18.4704 8.3705 30.6781 72.9496 1.1330 1.0287 8.2764 7.9331 39.8445 22.6993 15.4574 15.6287 19.5870 14.6801
temp: 298.150 k
press: 1.00000 atm
elementType: 8 7 7 6 6 6 6 6 6 6 6 6 6 6 6 6 6 6 6 6 6 6 6 1 1 1 1 1 1 1 1 1 1 1 1 1 1 1 1 1 1 1 1
symmnumber: 1
zpe: 920625.0 jmol-1
zpe.correction: 0.350648 hartree
zpe.thermalcorrener: 0.369505 hartree
zpe.thermalcorrenthalpy: 0.370449 hartree
zpe.thermalcorrgfe: 0.299877 hartree
zpe.sumelectzpe: -957.195466 hartree
zpe.sumelectthermal: -957.176608 hartree
zpe.sumelectthermalent: -957.175664 hartree
zpe.sumelectthermalfe: -957.246236 hartree
dipole: -0.2299 -0.4023 -0.2240
dipole: 0.5146
quadrupole: -111.4893 -126.4837 -135.8717
quadrupole: 0.2424 3.7406 -1.9176
quadrupole: 13.1256 -1.8688 -11.2568 0.2424 3.7406 -1.9176
hfenergy: -957.5461131 hartree
pointgroup: C01 [X(C20H20N2O1)]
dipole: 0.1027426 0.1517027 -0.0861638 debye
polarizability: 293.8050247|-4.6419037|295.1178982|-17.224367|20.4465378|140.7301385 unknown
InChI: InChI=1S/C20H20N2O/c1-3-9-16(10-4-1)19-20(17-11-5-2-6-12-17)23-18(21-19)15-22-13-7-8-14-22/h1-6,9-12H,7-8,13-15H2
charge 0 multiplicity 1
43 atoms
O  0.771191 1.319167 -0.415311
N  3.783194 0.492046 0.373162
N  0.864511 -0.946937 -0.601258
C  5.199273 0.917756 0.165062
C  3.920408 -0.806666 1.102091
C  6.019129 -0.381973 -0.149398
C  5.173051 -1.532012 0.494073
C  3.025943 0.365257 -0.910744
C  1.563053 0.177547 -0.664398
C  -0.544167 0.821568 -0.184372
C  -0.473163 -0.574988 -0.27751
C  -1.578752 1.842068 0.006307
C  -1.480191 -1.628989 -0.05157
C  -2.92934 1.609668 -0.378611
C  -1.227528 3.112429 0.54569
C  -1.321615 -2.883576 -0.702571
C  -2.57647 -1.454176 0.837032
C  -3.90302 2.614755 -0.207604
C  -2.205476 4.114334 0.711424
C  -2.251121 -3.923699 -0.494164
C  -3.502764 -2.497383 1.045848
C  -3.548918 3.870213 0.341268
C  -3.349916 -3.734889 0.376841
H  5.561038 1.369903 1.107941
H  5.265762 1.685349 -0.625162
H  2.993083 -1.397343 1.02406
H  4.095139 -0.580507 2.170587
H  7.03837 -0.327305 0.271769
H  6.120542 -0.529941 -1.239586
H  4.869613 -2.272657 -0.266863
H  5.736151 -2.074298 1.273597
H  3.362554 -0.484951 -1.548329
H  3.173401 1.300445 -1.478719
H  -3.210326 0.651916 -0.827739
H  -0.187478 3.301365 0.829673
H  -0.458272 -3.026038 -1.360051
H  -2.691875 -0.511891 1.382645
H  -4.937154 2.421714 -0.513703
H  -1.920025 5.085424 1.13076
H  -2.117324 -4.882399 -1.007795
H  -4.338129 -2.34842 1.73928
H  -4.30812 4.649178 0.471869
H  -4.071364 -4.543264 0.540082
