program: Gaussian 09
title: 000214422
version: EM64L-G09RevD.01
frameworkgroup: C1[X(C22H27N3O)]
method: RPBEPBE
basis: SDD
operation: Freq
keyword: #p
keyword: freq=noraman
keyword: PBEPBE/SDD
title: #p freq=noraman PBEPBE/SDD
converged: YES YES NO NO
title: Mulliken charges:
elementType: O N N N C C C C C C C C C C C C C C C C C C C C C C H H H H H H H H H H H H H H H H H H H H H H H H H H H
charge: -0.277892 -0.104490 -0.295333 -0.101092 -0.380193 -0.350196 -0.327826 -0.323201 -0.465187 0.184029 -0.672989 -0.671603 0.161459 -0.024600 0.298890 0.320952 -0.392611 -0.377969 -0.384630 -0.397629 -0.233775 -0.234122 -0.239772 -0.239398 -0.244897 -0.246439 0.228648 0.176415 0.226643 0.184778 0.205149 0.187142 0.203140 0.186512 0.263715 0.254335 0.203874 0.208289 0.227259 0.205356 0.212760 0.226682 0.205315 0.265207 0.250377 0.266077 0.257419 0.231665 0.228620 0.226917 0.227974 0.231540 0.228705
chargesum: 0.00000
title: Mulliken charges with hydrogens summed into heavy atoms:
elementType: O N N N C C C C C C C C C C C C C C C C C C C C C C
charge: -0.277892 -0.104490 -0.031617 -0.101092 0.024870 0.061225 0.064465 0.066450 -0.006978 0.184029 -0.032085 -0.026847 0.161459 -0.024600 0.298890 0.320952 -0.127404 -0.127592 -0.118553 -0.140210 -0.002110 -0.005501 -0.012855 -0.011424 -0.013356 -0.017734
polarizability: 3.43841522e+02 1.46767799e+01 3.19145330e+02 -1.42321762e+01 2.18069192e+01 1.74589078e+02
1716.lowfreq: -12.8822 -1.2917 -0.0008 -0.0007 0.0007 5.3355 7.4254 10.1153 24.5112
frequency: -9.1247 10.0248 24.4751 32.3516 42.0134 48.0839 60.8843 76.3322 83.5897 86.1767 107.6563 112.9562 120.4298 134.4889 148.2830 191.4174 196.8186 218.7429 224.6338 244.5008 277.0347 285.6096 288.9192 310.5993 340.2464 364.1737 377.7667 400.6970 407.9532 410.8700 432.0216 463.4769 493.9219 496.5937 534.0503 575.7598 613.7791 616.5324 641.4029 665.4341 678.9870 688.8886 697.2605 702.7118 706.0400 746.0692 759.2517 772.9270 780.3957 793.9434 796.1877 805.3708 850.3545 860.9258 892.9607 914.2894 926.3858 935.0564 937.7957 971.5854 979.0791 985.6007 986.2075 987.9207 989.1357 995.8553 996.9689 999.9814 1023.0721 1029.2452 1033.8874 1052.6046 1073.1905 1074.9109 1080.4856 1082.3207 1085.0608 1088.1355 1115.3970 1119.3727 1143.0415 1164.8936 1172.6955 1174.3794 1182.3304 1190.6839 1195.4284 1203.7904 1208.1700 1239.8265 1252.5317 1276.5836 1285.0979 1292.3071 1309.2952 1319.4778 1323.6649 1351.1305 1357.8355 1362.1540 1369.0006 1377.0020 1379.5473 1387.9658 1389.0749 1391.9719 1435.0012 1438.4530 1453.2578 1459.8174 1461.8511 1468.1115 1469.6422 1471.0823 1476.5373 1480.2822 1485.6868 1490.0939 1493.1736 1495.5149 1562.3161 1575.2548 1585.1596 1588.1876 1614.3291 1617.7075 2835.8947 2837.8008 2847.0120 2860.4712 2862.5192 2982.1608 2983.5216 3024.2768 3027.9300 3034.6719 3049.2084 3058.6682 3074.9250 3076.1044 3090.7970 3091.3342 3125.2927 3128.3009 3135.4869 3137.5993 3149.7449 3152.8553 3159.5570 3161.4939 3169.6885 3170.8920 3436.8320
redmass: 3.2884 4.6526 4.5777 3.8964 3.8397 4.3780 2.7932 4.2770 2.8870 2.2051 3.1412 2.4681 3.1434 5.8025 2.3154 1.7583 1.9837 1.7322 3.0866 5.3192 2.6860 2.2973 4.0076 2.6467 4.0742 4.2067 4.5286 2.8288 2.8996 3.8352 3.3134 2.9463 3.2182 3.6049 3.9180 5.4502 6.3430 6.4681 4.0625 6.8698 1.5125 6.1494 1.8663 4.3114 1.8388 2.5098 3.8425 2.0363 2.1238 1.1773 1.1345 1.2394 1.2501 1.2476 7.0246 1.9249 1.4667 1.5103 4.8908 2.1590 1.3860 2.2636 1.3965 6.1452 5.9367 3.2795 1.7325 1.3134 2.3496 2.1230 2.1258 2.8959 1.9994 1.9704 2.0774 1.6819 2.0981 2.3867 1.9509 3.6668 2.1565 2.0231 1.0668 1.0580 2.9392 1.1219 1.1698 2.0551 2.1800 1.9066 1.6976 1.1194 1.1640 1.2334 1.2961 1.4253 1.3610 1.3681 3.2665 1.3313 1.3666 6.3997 7.4191 1.2383 1.2502 1.4382 2.3488 2.3345 1.1899 1.0575 1.0529 2.2085 1.0784 1.0646 1.0688 1.0556 1.0664 1.0755 1.0865 2.7347 8.6695 6.6770 6.3092 7.5296 6.1535 6.2718 1.0717 1.0716 1.0721 1.0713 1.0709 1.0357 1.0358 1.0869 1.0862 1.0871 1.0859 1.0900 1.0983 1.0979 1.1003 1.1002 1.0847 1.0849 1.0885 1.0886 1.0933 1.0930 1.0963 1.0957 1.1001 1.1009 1.0741
irintensity: 0.0768 0.0726 0.1645 0.1738 0.3132 0.3590 0.2166 0.0768 0.5638 0.6142 0.8323 3.3717 1.7618 1.6820 0.7213 0.3225 0.8456 0.2819 1.4691 0.2469 0.9441 0.9056 0.7782 0.0040 1.4471 0.6034 1.5928 0.1574 0.1083 1.4605 4.8842 8.5639 4.8072 1.8974 9.0968 8.6355 1.0938 0.0779 41.7513 15.3019 61.8375 5.5535 80.9736 3.4612 19.2393 8.3013 26.4477 75.5098 18.2386 5.3412 4.9500 3.9516 2.0610 0.3292 9.0657 2.5426 10.4595 3.0741 30.4179 2.6951 2.1736 6.7859 1.5680 1.8574 1.0044 31.8462 14.2236 0.7986 10.8381 4.2134 3.5199 5.6095 26.2856 14.8307 35.9094 0.6395 3.6747 51.4846 16.8143 25.0725 17.0555 8.7636 0.0581 0.0242 3.9582 3.8588 0.2412 11.8955 32.6421 13.3791 18.4686 2.2360 28.2687 20.3589 5.2102 1.8061 0.9537 6.8211 9.7223 4.0582 15.2998 0.3862 2.1272 21.4106 24.7687 1.5483 14.5422 7.3268 87.2260 1.2091 6.6538 12.2406 2.1583 7.7445 0.7397 13.7182 7.5384 19.5444 3.3513 19.3655 30.0593 7.8103 4.3821 0.0628 8.3305 10.0125 81.1776 62.6539 39.1075 224.6993 111.4186 32.9808 33.4695 17.0690 21.7091 21.4121 9.6769 31.5498 37.9937 84.6591 33.8112 50.3319 1.1228 1.4929 8.7123 6.5237 41.1203 20.5765 14.6621 17.8314 22.4108 12.1483 0.1298
temp: 298.150 k
press: 1.00000 atm
elementType: 8 7 7 7 6 6 6 6 6 6 6 6 6 6 6 6 6 6 6 6 6 6 6 6 6 6 1 1 1 1 1 1 1 1 1 1 1 1 1 1 1 1 1 1 1 1 1 1 1 1 1 1 1
symmnumber: 1
zpe: 1161830.6 jmol-1
zpe.correction: 0.442518 hartree
zpe.thermalcorrener: 0.467258 hartree
zpe.thermalcorrenthalpy: 0.468202 hartree
zpe.thermalcorrgfe: 0.384614 hartree
zpe.sumelectzpe: -1092.067556 hartree
zpe.sumelectthermal: -1092.042816 hartree
zpe.sumelectthermalent: -1092.041872 hartree
zpe.sumelectthermalfe: -1092.125460 hartree
dipole: 0.2512 2.6109 -0.1915
dipole: 2.6299
quadrupole: -133.1443 -147.4891 -156.7414
quadrupole: 2.0068 -0.6835 4.9589
quadrupole: 12.6473 -1.6975 -10.9498 2.0068 -0.6835 4.9589
hfenergy: -1092.5100738 hartree
pointgroup: C01 [X(C22H27N3O1)]
dipole: -0.0496831 -1.0280545 0.1059789 debye
polarizability: 341.9292054|18.9383407|308.8679633|14.6314331|-44.7342359|186.7787614 unknown
InChI: InChI=1S/C22H27N3O/c1-3-25(4-2)16-15-23-17-20-24-21(18-11-7-5-8-12-18)22(26-20)19-13-9-6-10-14-19/h5-14,23H,3-4,15-17H2,1-2H3
charge 0 multiplicity 1
53 atoms
O  0.245223 -0.566247 -0.361072
N  -6.276882 -0.136571 0.190978
N  -2.529411 0.328902 -0.204151
N  0.803452 1.585537 -0.858608
C  -4.845571 -0.07408 0.576476
C  -3.954833 0.39114 -0.592997
C  -6.630235 -1.413724 -0.487277
C  -7.198554 0.202492 1.308847
C  -1.608271 0.836189 -1.243781
C  -0.177467 0.701464 -0.829231
C  -7.843232 -1.282664 -1.42791
C  -7.239142 1.712135 1.612685
C  1.63999 -0.41608 -0.086282
C  1.968296 0.913098 -0.37864
C  2.333278 -1.636289 0.336436
C  3.220406 1.676262 -0.21765
C  3.703433 -1.854765 0.017379
C  1.623513 -2.651672 1.038471
C  3.43279 2.823683 -1.030857
C  4.20057 1.337002 0.755374
C  4.346751 -3.046274 0.409681
C  2.271485 -3.842576 1.425515
C  4.608357 3.591134 -0.897219
C  5.373804 2.108694 0.888768
C  3.63741 -4.044998 1.118315
C  5.588413 3.234616 0.058884
H  -4.71711 0.641514 1.406476
H  -4.476543 -1.063125 0.955108
H  -4.212061 1.438629 -0.836051
H  -4.182616 -0.213498 -1.507164
H  -5.755338 -1.729302 -1.086104
H  -6.813868 -2.231333 0.256657
H  -8.213737 -0.124332 1.018683
H  -6.938416 -0.364682 2.239063
H  -2.256009 -0.614227 0.106849
H  -1.797631 1.910689 -1.412352
H  -1.747851 0.322544 -2.230856
H  -8.757337 -0.982738 -0.884167
H  -7.643198 -0.51954 -2.200177
H  -8.052655 -2.247798 -1.926403
H  -6.249561 2.097429 1.918914
H  -7.557426 2.270253 0.715016
H  -7.949469 1.923102 2.434094
H  4.255988 -1.101228 -0.552579
H  0.566539 -2.496577 1.277046
H  2.659268 3.102598 -1.753056
H  4.034997 0.485955 1.423944
H  5.400292 -3.200359 0.151505
H  1.711769 -4.612055 1.968691
H  4.75871 4.469337 -1.535062
H  6.115725 1.838072 1.648509
H  4.140419 -4.970059 1.420516
H  6.501146 3.83162 0.164261
