program: Gaussian 09
title: 000002632
version: EM64L-G09RevD.01
frameworkgroup: C1[X(C16H17N5O7S2)]
method: RPBEPBE
basis: SDD
operation: Freq
keyword: #p
keyword: freq=noraman
keyword: PBEPBE/SDD
title: #p freq=noraman PBEPBE/SDD
converged: YES YES NO NO
title: Mulliken charges:
elementType: S S O O O O O O O N N N N N C C C C C C C C C C C C C C C C H H H H H H H H H H H H H H H H H
charge: 0.240438 0.241490 -0.155157 -0.256543 -0.399809 -0.240549 -0.287494 -0.200762 -0.246114 -0.173443 -0.368001 -0.066216 -0.003287 -0.566093 -0.474281 -0.186761 0.127403 0.165562 0.396544 -0.831704 -0.488506 0.121396 0.223976 -0.049450 0.342180 0.303040 -0.667305 -0.749620 -0.209122 -0.495811 0.319306 0.310436 0.306225 0.286271 0.343854 0.290843 0.266589 0.391845 0.328507 0.248558 0.248461 0.254485 0.231912 0.227115 0.232295 0.330047 0.337250
chargesum: 0.00000
title: Mulliken charges with hydrogens summed into heavy atoms:
elementType: S S O O O O O O O N N N N N C C C C C C C C C C C C C C C C
charge: 0.240438 0.241490 -0.155157 -0.256543 -0.007965 -0.240549 -0.287494 -0.200762 -0.246114 -0.173443 -0.024146 -0.066216 -0.003287 0.101203 -0.154975 0.123676 0.127403 0.165562 0.396544 -0.239208 0.068926 0.121396 0.223976 -0.049450 0.342180 0.303040 -0.338798 0.001884 -0.209122 0.195510
polarizability: 4.08392191e+02 6.28914877e-01 2.77126757e+02 -1.19961553e+01 3.10771292e+01 2.04532474e+02
1716.lowfreq: -0.0017 -0.0012 0.0008 1.4378 2.9132 5.7004 7.7951 10.8417 16.3853
frequency: 7.7756 10.5778 16.3718 21.2446 29.5156 40.8376 42.6272 53.3019 62.4376 68.4678 79.8723 84.8513 91.3161 105.3179 117.6564 126.4589 133.0087 144.5661 160.6086 167.7214 170.3867 200.1094 218.5025 227.8142 243.8603 246.1254 272.6695 283.3996 284.8432 290.7952 318.2766 328.6005 340.7509 362.6203 392.7875 403.8642 410.5982 414.4064 422.9121 450.7649 473.9412 488.6750 493.7869 528.2084 541.1224 555.2995 558.7751 574.5975 574.9874 610.1806 612.9702 626.0741 652.8744 661.3038 683.0037 723.5613 727.4251 729.4731 738.6129 750.3472 767.0470 791.0369 795.3250 804.9041 810.8797 856.4734 884.2715 890.3373 907.3943 918.7818 948.3139 967.8182 991.5111 993.1409 1005.1248 1008.7502 1025.4122 1042.0927 1059.6522 1089.3621 1100.8599 1104.4522 1111.3664 1139.2410 1149.1403 1171.4129 1182.9600 1191.1818 1201.6230 1211.1682 1223.3967 1239.0202 1249.5367 1259.7651 1283.2767 1294.2455 1318.7652 1334.1068 1350.4701 1384.0326 1385.8202 1413.6272 1426.8604 1431.9064 1450.1371 1452.1393 1454.1363 1465.8414 1466.9275 1470.8850 1532.8179 1587.3146 1601.0110 1614.5572 1631.4896 1637.7879 1649.9944 1731.9153 2987.8394 3007.8834 3008.5853 3011.5997 3035.4311 3069.2787 3075.9367 3092.9779 3098.3377 3131.8727 3142.7356 3144.1583 3255.8589 3468.8411 3529.8598 3560.7299 3712.0369
redmass: 5.2932 7.6738 7.0838 8.0051 5.3955 9.8336 3.7182 1.7686 2.8608 6.7270 4.2914 2.2691 7.3631 5.3610 3.4706 2.1775 5.9872 5.5444 7.0752 9.5221 3.4107 5.7357 8.0349 5.8875 5.9078 5.9046 8.6403 6.4074 1.1594 5.0144 4.8685 3.7005 4.9900 5.1297 7.4407 6.8166 4.8981 1.2729 4.9996 3.8493 4.2709 4.1439 5.9659 3.5666 5.1894 3.3371 5.6255 5.5957 2.7888 3.7539 3.4534 6.4023 4.3080 7.7542 6.2732 6.0864 4.3982 1.3688 6.7005 3.2437 5.4838 4.6710 6.4657 1.7315 4.9630 1.8867 6.8672 6.0283 6.6387 4.6929 5.4640 4.1372 1.9542 5.7722 6.1238 3.4345 3.2308 1.6841 3.5531 2.1704 1.4357 1.2508 2.2060 1.7133 1.4826 1.2608 1.5485 2.4310 1.8258 2.4837 1.6737 1.2608 1.5007 3.5992 1.8847 2.2251 1.8385 4.3132 1.3771 1.2457 5.7318 1.2582 1.0952 5.2966 1.0531 1.0615 1.0495 1.1348 1.0963 1.9354 9.7875 1.5156 8.5989 7.9597 9.0590 3.1320 8.8541 12.8350 1.0291 1.0599 1.0374 1.0660 1.0835 1.0891 1.1014 1.1056 1.0962 1.1029 1.0975 1.1015 1.0958 1.0775 1.0644 1.0451 1.1047
irintensity: 0.2132 0.1745 0.1260 0.0776 1.3863 3.0560 3.4730 0.9358 0.9256 0.4352 2.6643 2.0297 0.6288 1.5688 6.7288 0.2413 0.1756 3.8251 3.4410 0.7872 0.4017 6.5797 2.5097 5.4209 5.4303 0.6870 0.9630 13.2257 82.4311 12.3339 3.0962 4.1411 26.1002 5.1461 20.5965 6.2923 14.9283 247.1973 6.3731 8.4683 10.4175 27.1208 4.1178 34.4035 18.7992 18.4779 4.8841 22.8358 29.4016 12.6984 40.7576 20.4479 41.2195 0.2895 3.7097 9.4460 11.0087 47.7832 31.5018 2.2567 12.6495 12.9653 3.2136 65.9829 109.5914 2.1311 43.4789 40.1615 69.4174 64.6767 37.4732 66.8469 162.7530 19.1152 187.9663 12.5997 136.9874 31.5372 259.6744 45.5759 54.9638 0.2711 29.0191 21.1411 10.6859 20.8496 91.0424 264.9148 91.5490 4.6990 51.7386 3.6600 4.7091 85.3127 5.2247 99.4435 32.4271 157.2431 7.3676 52.1600 175.2241 9.4358 19.1500 10.7665 14.1217 28.0233 15.4532 185.5279 22.0373 666.8894 5.8886 12.7501 137.1042 102.6898 201.7086 497.6265 164.9174 497.5254 81.7000 12.2137 2.4698 12.0222 40.1426 17.9154 2.2026 36.9123 6.3745 16.3928 8.8281 9.8868 44.6106 69.7353 60.6660 119.6845 49.3696
temp: 298.150 k
press: 1.00000 atm
elementType: 16 16 8 8 8 8 8 8 8 7 7 7 7 7 6 6 6 6 6 6 6 6 6 6 6 6 6 6 6 6 1 1 1 1 1 1 1 1 1 1 1 1 1 1 1 1 1
symmnumber: 1
zpe: 866997.3 jmol-1
zpe.correction: 0.330222 hartree
zpe.thermalcorrener: 0.361532 hartree
zpe.thermalcorrenthalpy: 0.362477 hartree
zpe.thermalcorrgfe: 0.260933 hartree
zpe.sumelectzpe: -2214.069340 hartree
zpe.sumelectthermal: -2214.038030 hartree
zpe.sumelectthermalent: -2214.037086 hartree
zpe.sumelectthermalfe: -2214.138629 hartree
dipole: 3.0742 1.8538 7.1187
dipole: 7.9727
quadrupole: -137.1365 -186.0710 -186.2176
quadrupole: 1.0038 -5.3175 6.0201
quadrupole: 32.6719 -16.2626 -16.4093 1.0038 -5.3175 6.0201
hfenergy: -2214.3995621 hartree
pointgroup: C01 [X(C16H17N5O7S2)]
dipole: -1.3672325 -2.5130842 -1.2860308 debye
polarizability: 406.7237985|-15.1196702|194.6836157|-11.7557325|11.4501386|288.6440072 unknown
InChI: InChI=1S/C16H17N5O7S2/c1-6(22)28-3-7-4-29-14-10(13(24)21(14)11(7)15(25)26)19-12(23)9(20-27-2)8-5-30-16(17)18-8/h5,10,14,19,25H,3-4,17H2,1-2H3
charge 0 multiplicity 1
47 atoms
S  2.066164 -0.005987 1.935763
S  -6.818063 0.423382 2.70979
O  0.586666 2.502116 -1.717575
O  6.067582 -1.414347 -0.337774
O  2.613824 1.013014 -3.318535
O  4.676621 1.799181 -2.594043
O  -2.423751 0.991574 1.739922
O  -4.710325 -1.23521 -1.847461
O  7.061682 -0.979521 1.734644
N  1.806372 0.598937 -0.767774
N  -1.394123 0.274313 -0.213938
N  -3.584051 -0.671592 -1.179339
N  -6.232686 -0.676092 0.324719
N  -8.521639 -0.973658 0.952588
C  1.11763 -0.153169 0.306258
C  -0.112231 0.815066 0.147033
C  0.730913 1.524487 -0.970963
C  3.188815 0.604399 -1.042396
C  4.094231 0.053796 -0.15686
C  3.691342 -0.601216 1.154752
C  5.580872 0.008499 -0.424432
C  3.595402 1.212235 -2.348741
C  -2.502349 0.421272 0.608725
C  -3.795009 -0.15809 0.032458
C  -5.039452 -0.089621 0.812675
C  6.845485 -1.759506 0.779737
C  -5.152955 0.535715 2.058249
C  7.368502 -3.170534 0.635044
C  -7.241439 -0.515328 1.153879
C  -4.25784 -1.722349 -3.17013
H  0.941921 -1.21376 0.069162
H  -0.246136 1.462978 1.032674
H  4.465752 -0.408717 1.917631
H  3.619004 -1.696756 1.028017
H  -1.566374 -0.17252 -1.122269
H  5.85177 0.350784 -1.430463
H  6.129085 0.598276 0.334924
H  2.863342 1.506051 -4.145917
H  -4.366457 1.039005 2.613236
H  6.564656 -3.85116 0.309452
H  7.794482 -3.509425 1.590243
H  8.154575 -3.195592 -0.140789
H  -5.170698 -2.122478 -3.637606
H  -3.502122 -2.51867 -3.05251
H  -3.847165 -0.891458 -3.769596
H  -9.260617 -0.820196 1.631081
H  -8.719806 -1.477024 0.090858
