program: Gaussian 09
title: 000214398
version: EM64L-G09RevD.01
frameworkgroup: C1[X(C17H16N2O2)]
method: RPBEPBE
basis: SDD
operation: Freq
keyword: #p
keyword: freq=noraman
keyword: PBEPBE/SDD
title: #p freq=noraman PBEPBE/SDD
converged: YES YES NO NO
title: Mulliken charges:
elementType: O O N N C C C C C C C C C C C C C C C C C H H H H H H H H H H H H H H H H
charge: -0.435050 -0.265592 -0.307631 -0.061803 -0.033085 0.258271 0.018688 -0.371176 0.191163 0.436323 -0.491532 -0.390602 -0.390695 -0.365878 -0.404645 -0.219489 -0.227341 -0.354291 -0.350020 0.318036 -0.537531 0.236540 0.236844 0.232568 0.234386 0.257573 0.268032 0.350838 0.253246 0.275726 0.230246 0.231819 0.250248 0.238664 0.245124 0.221450 0.220578
chargesum: 0.00000
title: Mulliken charges with hydrogens summed into heavy atoms:
elementType: O O N N C C C C C C C C C C C C C C C C C
charge: -0.084213 -0.265592 -0.307631 -0.061803 -0.033085 0.258271 0.018688 0.102208 0.191163 0.436323 -0.024578 -0.133029 -0.122663 -0.112632 -0.128919 0.010757 0.004478 -0.104043 -0.111356 0.318036 0.149620
polarizability: 2.63582472e+02 -6.72909798e+00 2.07098390e+02 -1.82042935e+01 9.36636644e+00 1.45875165e+02
1716.lowfreq: -6.7339 -5.5126 0.0005 0.0006 0.0009 2.0893 28.8559 37.0982 42.4083
frequency: 28.6651 37.0634 42.3525 89.7409 97.0481 118.4739 139.3891 160.0210 175.4486 185.2045 225.2398 236.5303 256.4186 295.1400 322.4258 337.2667 370.8781 379.9083 416.0828 432.9276 444.2840 448.5396 492.5848 521.3995 532.0666 571.8246 583.6033 629.9216 650.0726 656.1478 683.8444 730.9276 739.1963 757.6456 769.5423 778.5349 818.6828 821.0003 832.1120 854.0000 883.8474 894.9247 910.7580 919.3706 931.7488 961.9181 965.8352 975.1889 987.3406 988.6061 996.1715 1003.9126 1020.9026 1072.8239 1087.2387 1111.9889 1113.4023 1138.9883 1153.8628 1156.2378 1159.4525 1164.7604 1176.0995 1181.4732 1205.9752 1212.1587 1227.2688 1263.4752 1282.3721 1290.9124 1301.3117 1324.9371 1359.4741 1378.1754 1399.9194 1414.2939 1437.0374 1447.3883 1458.8448 1464.6007 1467.2116 1472.6258 1499.9520 1501.7787 1584.9552 1591.6519 1616.3347 1622.7503 1642.4063 2958.8056 2981.3184 3004.3320 3045.0355 3046.2967 3069.7245 3124.6741 3132.2400 3137.1141 3145.9818 3152.5773 3158.2606 3167.2015 3170.7783 3177.2708 3542.6249
redmass: 4.0324 5.5591 4.6132 3.6342 3.7118 1.9977 4.0891 5.0483 4.0687 4.0598 3.7065 1.3001 3.6809 4.8536 3.3006 3.6471 2.2011 2.3229 2.9990 5.4301 3.9227 4.0517 4.2170 2.9152 6.0810 4.3143 6.0329 7.0991 5.0572 4.8351 6.0221 4.1627 4.1705 3.4845 5.2106 1.5297 1.4834 1.5100 1.7009 3.3120 2.0522 2.1197 4.4406 5.8714 3.9075 1.4067 1.5253 1.3700 5.3730 7.7804 1.3318 2.5741 2.2166 1.6301 2.3110 1.3166 1.2602 2.5212 1.5510 1.3763 1.5714 1.1678 1.3624 1.4431 1.3224 2.2759 3.4841 2.6387 1.4212 1.3325 1.4234 2.3496 2.5910 5.2985 5.3761 4.1449 1.1741 2.5906 2.3619 1.1909 1.0499 1.0740 2.4309 1.1164 7.5644 7.1656 7.9732 6.5233 9.1467 1.0330 1.0613 1.0647 1.0999 1.1039 1.1048 1.0993 1.0858 1.0887 1.0903 1.0878 1.0956 1.0955 1.0999 1.0953 1.0658
irintensity: 1.0858 0.0329 0.1171 3.0205 4.6745 0.5204 5.7501 1.9493 0.7269 1.1619 7.9175 0.2355 1.6496 3.8600 3.6682 25.2376 42.2489 38.6309 0.3223 1.6309 2.5236 15.6218 7.8931 8.5631 4.7861 45.1469 11.9938 2.5575 13.7681 14.7848 1.5318 0.6062 5.9318 19.3928 3.7926 55.6480 27.2114 17.2918 28.0496 37.0950 42.2067 32.0890 32.2173 45.5193 12.9716 0.5555 0.7248 1.4801 11.5178 46.0675 0.2105 14.7600 3.8003 0.5059 5.7444 6.3938 0.1827 53.1559 79.4887 2.0053 1.4198 2.8498 108.2005 2.7228 17.9414 70.0451 162.7871 47.3945 23.6033 6.8273 2.2862 93.0746 105.0242 31.0384 1.9712 5.9721 9.7123 13.8151 41.6331 10.1705 13.2398 52.0677 92.4755 2.5846 12.7574 10.9895 44.0308 79.5141 50.6230 72.8051 44.0535 65.6579 20.1231 49.2915 39.9503 27.3545 0.9081 6.8116 9.4612 11.1380 13.7514 7.5958 22.5560 4.4482 10.4971
temp: 298.150 k
press: 1.00000 atm
elementType: 8 8 7 7 6 6 6 6 6 6 6 6 6 6 6 6 6 6 6 6 6 1 1 1 1 1 1 1 1 1 1 1 1 1 1 1 1
symmnumber: 1
zpe: 766214.5 jmol-1
zpe.correction: 0.291836 hartree
zpe.thermalcorrener: 0.309669 hartree
zpe.thermalcorrenthalpy: 0.310613 hartree
zpe.thermalcorrgfe: 0.245297 hartree
zpe.sumelectzpe: -915.845767 hartree
zpe.sumelectthermal: -915.827934 hartree
zpe.sumelectthermalent: -915.826990 hartree
zpe.sumelectthermalfe: -915.892306 hartree
dipole: -2.1465 1.6148 1.7176
dipole: 3.1883
quadrupole: -112.8679 -110.2774 -122.9369
quadrupole: 2.3201 -2.3287 0.4541
quadrupole: 2.4928 5.0833 -7.5761 2.3201 -2.3287 0.4541
hfenergy: -916.1376028 hartree
pointgroup: C01 [X(C17H16N2O2)]
dipole: 0.812018 -0.6213008 0.7266484 debye
polarizability: 262.8042407|-8.1537673|205.8901115|18.2321098|-15.1024659|147.8616748 unknown
InChI: InChI=1S/C17H16N2O2/c1-21-13-8-6-12(7-9-13)17(20)15-5-3-2-4-14(15)16-18-10-11-19(16)17/h2-9,20H,10-11H2,1H3
charge 0 multiplicity 1
37 atoms
O  -0.449477 0.516657 2.254566
O  5.018871 -0.2165 -0.966847
N  -1.148865 1.455212 0.093824
N  -3.207594 2.083907 -0.785386
C  -0.447029 0.361778 0.770875
C  -1.354317 -0.825929 0.361949
C  -2.426421 1.102273 -0.393498
C  -1.065864 2.921331 0.219378
C  -2.53455 -0.362676 -0.286606
C  1.021622 0.233189 0.367892
C  -2.391808 3.340919 -0.545732
C  -1.159913 -2.195157 0.604392
C  -3.541417 -1.255852 -0.696158
C  1.402345 0.482208 -0.976749
C  2.006686 -0.181866 1.289647
C  -2.170173 -3.100162 0.191495
C  -3.347833 -2.636155 -0.449407
C  2.735693 0.322526 -1.388418
C  3.3540 -0.343373 0.892264
C  3.718496 -0.091549 -0.453157
C  6.073519 -0.63798 -0.04234
H  -0.156587 3.325156 -0.258796
H  -1.071338 3.232321 1.282298
H  -2.162927 3.801154 -1.525096
H  -2.994808 4.062698 0.031844
H  -0.248412 -2.553485 1.094044
H  -4.442404 -0.884792 -1.194104
H  -1.382956 0.394656 2.569042
H  0.643129 0.805598 -1.697782
H  1.715262 -0.356881 2.328707
H  -2.039803 -4.173825 0.366926
H  -4.112417 -3.356753 -0.759599
H  3.042807 0.512554 -2.421318
H  4.097471 -0.656999 1.631248
H  6.991065 -0.668049 -0.648098
H  6.196949 0.086673 0.786131
H  5.867495 -1.643825 0.373068
