program: Gaussian 09
title: 000214395
version: EM64L-G09RevD.01
frameworkgroup: C1[X(C15H25N)]
method: RPBEPBE
basis: SDD
operation: Freq
keyword: #pfreq=noraman
keyword: PBEPBE/SDD
title: #p freq=noraman PBEPBE/SDD
converged: YES YES NO NO
title: Mulliken charges:
elementType: N C C C C C C C C C C C C C C C H H H H H H H H H H H H H H H H H H H H H H H H H
charge: -0.077677 -0.188614 -0.450456 -0.375684 -0.421275 -0.014600 0.494833 -0.718430 -0.720307 -0.401866 -0.444217 -0.628227 -0.620488 -0.248907 -0.230599 -0.247906 0.218745 0.203506 0.195226 0.221138 0.181519 0.203907 0.187383 0.191824 0.210086 0.220477 0.204047 0.216386 0.210110 0.205207 0.228460 0.237622 0.212330 0.183998 0.262725 0.220151 0.224009 0.185870 0.220861 0.223400 0.225434
chargesum: 0.00000
title: Mulliken charges with hydrogens summed into heavy atoms:
elementType: N C C C C C C C C C C C C C C C
charge: -0.077677 0.030131 -0.051724 0.026973 -0.029985 0.177224 0.494833 -0.083820 -0.088604 -0.173407 -0.206595 0.030826 0.009542 -0.028046 -0.007199 -0.022472
polarizability: 1.59508431e+02 -5.50948204e+00 1.90883831e+02 -1.86528735e-01 -1.07032776e+00 1.46695014e+02
1716.lowfreq: -9.5018 -0.0006 -0.0003 0.0004 3.3183 12.2518 13.9256 24.0897 41.0837
frequency: 9.7127 23.8165 41.0493 54.6516 61.8491 81.3702 108.6196 153.5166 182.1817 202.8848 214.0637 217.9881 231.5868 239.3299 248.1615 258.1076 288.2248 344.6100 374.3132 381.1813 406.1395 428.7441 431.2487 474.5095 502.0214 555.2652 583.0789 617.0798 706.2227 731.3586 769.2333 785.3552 806.9208 822.1100 853.7164 912.1953 914.4818 922.9883 940.8462 955.7206 975.4255 985.3229 990.5889 992.0978 1006.6180 1015.4936 1031.2612 1032.5672 1059.8958 1067.2578 1080.6490 1090.2234 1112.9774 1129.1832 1140.6382 1167.6310 1170.7429 1177.1813 1187.6655 1201.6672 1205.1253 1228.8221 1263.0585 1274.1076 1278.2603 1289.0646 1314.0038 1318.7289 1330.3947 1347.6801 1352.8331 1373.4365 1376.0216 1385.0514 1391.6947 1419.3537 1440.3761 1441.2155 1453.9529 1461.2975 1461.7286 1468.5107 1469.6281 1474.1050 1475.5600 1479.9720 1482.1772 1483.7081 1486.9020 1488.6248 1589.8365 1610.7740 2831.0489 2843.8692 2860.5097 2947.3167 2955.0683 2962.2363 2964.6991 2969.2217 2992.7037 3007.2041 3014.7417 3015.8319 3031.8721 3034.9896 3056.2368 3063.9347 3066.9556 3071.3329 3074.2325 3108.6977 3113.5035 3115.2894 3130.3818 3140.5124 3159.6754
redmass: 2.8566 2.5290 3.6435 3.4477 3.2710 3.3624 2.3262 2.1968 2.9041 2.3912 2.9667 1.0669 1.2653 1.3050 1.2426 2.2933 2.3737 2.1733 2.4190 2.4440 2.8150 2.0970 2.3034 3.0268 2.9981 2.8939 2.8015 6.3995 1.6729 1.9718 1.9000 1.9678 3.8689 2.5225 1.2494 1.1854 1.4128 1.6357 1.8201 1.5462 1.3918 2.3811 2.8019 1.3700 2.7984 2.8963 2.0834 1.5961 2.3982 1.9627 1.9500 1.2679 1.6191 1.7817 1.7513 2.0014 1.0578 1.7716 1.1134 1.8415 1.7677 1.3199 2.3633 1.3861 1.4752 1.2175 1.3440 1.3951 1.4285 1.5096 1.4020 1.3819 1.4933 2.6684 1.2166 1.1427 1.2599 1.8216 1.0827 1.0544 1.0683 1.0549 1.0693 1.0733 1.1259 1.0787 1.2587 1.5361 1.0540 1.0503 5.9288 6.1061 1.0687 1.0581 1.0583 1.0731 1.0656 1.0626 1.0380 1.0365 1.0839 1.0940 1.0725 1.0895 1.0758 1.1010 1.0993 1.0989 1.0995 1.0985 1.1008 1.0966 1.0848 1.0874 1.0910 1.0959 1.1014
irintensity: 0.2863 0.0028 0.0695 0.0689 0.2083 0.2777 0.1794 1.1921 0.3441 0.3411 0.5613 0.0789 1.5732 0.3557 0.0692 0.7176 1.9464 6.7870 0.4702 0.6363 0.0136 0.4265 0.6040 0.5047 1.5595 4.1735 21.8533 0.1247 55.5769 7.5560 28.7361 8.0044 15.7202 4.0671 0.0090 3.8101 7.6264 1.1208 1.9769 1.2042 0.0877 5.3135 2.8615 0.7740 3.0981 6.2172 2.0125 24.3144 42.2206 1.4070 13.1385 5.7935 3.4358 2.4177 6.9525 5.5977 0.1269 10.8077 0.1393 4.5369 0.6531 2.9809 14.2493 1.2314 4.6057 2.1795 6.1600 0.6055 2.3207 4.5909 6.8347 5.9987 20.4544 1.8298 13.7217 1.7675 2.8760 10.0192 1.7153 15.1894 6.5098 1.0585 4.4861 2.9371 13.5923 10.2084 6.8654 18.8651 14.9595 24.8031 1.3961 10.0321 55.4277 67.9356 211.5929 3.2318 4.0765 39.4180 56.0555 33.0375 16.5222 8.0577 38.5761 30.9055 40.6864 92.0389 6.7636 87.1177 51.0857 68.6049 37.2977 20.5726 9.4897 1.7406 12.0728 45.1277 25.9388
temp: 298.150 k
press: 1.00000 atm
elementType: 7 6 6 6 6 6 6 6 6 6 6 6 6 6 6 6 1 1 1 1 1 1 1 1 1 1 1 1 1 1 1 1 1 1 1 1 1 1 1 1 1
symmnumber: 1
zpe: 956412.1 jmol-1
zpe.correction: 0.364278 hartree
zpe.thermalcorrener: 0.382690 hartree
zpe.thermalcorrenthalpy: 0.383634 hartree
zpe.thermalcorrgfe: 0.315343 hartree
zpe.sumelectzpe: -640.062003 hartree
zpe.sumelectthermal: -640.043591 hartree
zpe.sumelectthermalent: -640.042647 hartree
zpe.sumelectthermalfe: -640.110937 hartree
dipole: -0.1518 -0.2534 0.7563
dipole: 0.8119
quadrupole: -101.7791 -96.1603 -97.6133
quadrupole: -0.6518 -1.0336 -1.4565
quadrupole: -3.2615 2.3572 0.9043 -0.6518 -1.0336 -1.4565
hfenergy: -640.4262807 hartree
pointgroup: C01 [X(C15H25N1)]
dipole: 0.0569364 -0.1675548 -0.2659428 debye
polarizability: 161.4533368|9.2251623|187.5794606|-1.5235537|-7.5452275|148.0544792 unknown
InChI: InChI=1S/C15H25N/c1-13(2)10-11-15(12-16(3)4)14-8-6-5-7-9-14/h5-9,13,15H,10-12H2,1-4H3
charge 0 multiplicity 1
41 atoms
N  2.216834 -2.206348 0.926938
C  0.123392 -0.824428 0.399497
C  -1.303356 -1.07144 -0.18805
C  -2.353889 -0.036911 0.272156
C  1.048167 -2.025267 0.032324
C  -3.749718 -0.197505 -0.388709
C  0.662607 0.538035 -0.042177
C  -4.41832 -1.549753 -0.039787
C  -4.670771 0.979305 0.012901
C  0.938887 0.807413 -1.409557
C  0.867765 1.580382 0.898087
C  3.319658 -1.254041 0.67585
C  2.70352 -3.602491 0.925186
C  1.414838 2.071891 -1.820602
C  1.342289 2.849178 0.492891
C  1.620307 3.100103 -0.870514
H  0.041645 -0.827918 1.504829
H  -1.627613 -2.087846 0.111288
H  -1.249602 -1.069292 -1.297278
H  -1.976071 0.981458 0.053821
H  -2.469297 -0.099188 1.37585
H  0.438153 -2.945451 0.114744
H  1.358547 -1.944547 -1.042836
H  -3.605354 -0.159953 -1.490472
H  -5.423426 -1.621746 -0.4962
H  -3.826236 -2.410867 -0.398999
H  -4.537952 -1.652556 1.056723
H  -4.221385 1.951885 -0.262236
H  -5.657135 0.905888 -0.482445
H  -4.842385 0.984117 1.107079
H  0.781828 0.02302 -2.160448
H  0.656458 1.391377 1.957986
H  4.130267 -1.432531 1.40549
H  3.750581 -1.350288 -0.354144
H  2.969355 -0.218027 0.797957
H  3.514606 -3.709384 1.668304
H  1.885191 -4.286677 1.212952
H  3.103596 -3.937183 -0.066591
H  1.62469 2.257422 -2.880618
H  1.494296 3.638511 1.238255
H  1.989029 4.081753 -1.18894
