program: Gaussian 09
title: 000214438
version: EM64L-G09RevD.01
frameworkgroup: C1[X(C20H22N2O)]
method: RPBEPBE
basis: SDD
operation: Freq
keyword: #p
keyword: freq=noraman
keyword: PBEPBE/SDD
title: #p freq=noraman PBEPBE/SDD
converged: YES YES NO NO
title: Mulliken charges:
elementType: O N N C C C C C C C C C C C C C C C C C C C C H H H H H H H H H H H H H H H H H H H H H H
charge: -0.262587 -0.284802 -0.124124 -0.366440 -0.504476 -0.060525 0.187017 0.130021 -0.015743 -0.699605 -0.685030 0.304686 0.319881 -0.394809 -0.377902 -0.387896 -0.396490 -0.233769 -0.234052 -0.239825 -0.240912 -0.245099 -0.247595 0.219980 0.216258 0.226176 0.254215 0.207648 0.235578 0.207063 0.196598 0.237685 0.231127 0.212629 0.199338 0.264817 0.254883 0.266327 0.257566 0.230892 0.228693 0.225908 0.227548 0.230886 0.228261
chargesum: 0.00000
title: Mulliken charges with hydrogens summed into heavy atoms:
elementType: O N N C C C C C C C C C C C C C C C C C C C C
charge: -0.262587 -0.049224 -0.124124 0.069799 -0.024085 0.147123 0.187017 0.130021 -0.015743 -0.058259 -0.041935 0.304686 0.319881 -0.129992 -0.123019 -0.121569 -0.138923 -0.002877 -0.005360 -0.013918 -0.013364 -0.014213 -0.019334
polarizability: 3.16886196e+02 -1.46562817e+01 2.96877413e+02 1.30930244e+01 -1.44841272e+01 1.37246197e+02
1716.lowfreq: -8.8566 -0.0007 -0.0006 0.0004 3.5361 5.0814 7.0176 27.3529 33.7815
frequency: -8.4446 27.1896 33.7473 37.8546 49.8979 68.3194 79.3438 91.4598 98.3610 130.5749 149.6492 168.5886 196.8896 208.5677 240.3147 244.1875 254.9841 281.9779 286.8872 353.5065 360.9943 377.4577 402.1085 409.0183 413.3068 447.3187 483.5194 498.0508 516.7910 579.8641 613.9153 615.7193 645.0988 647.3770 665.1315 686.8763 697.7036 702.4970 705.4268 764.2713 772.3772 780.8523 792.1260 832.1895 850.4401 860.7358 906.8212 911.8124 926.5637 930.9638 935.2450 938.3644 944.5325 979.2699 986.2094 987.5825 988.7839 995.0430 996.9078 999.5636 1025.1615 1028.8522 1037.1774 1041.9029 1077.7415 1082.2400 1109.2991 1117.8174 1123.8098 1132.4737 1159.5452 1172.4880 1174.0466 1180.6492 1190.3059 1194.2804 1201.0380 1227.3829 1279.3715 1298.8549 1313.5130 1319.6050 1323.5706 1334.0737 1356.8853 1368.5860 1376.0877 1378.0298 1383.5928 1389.0335 1434.6238 1438.1223 1447.5546 1452.9128 1463.9149 1465.0563 1467.4094 1480.3199 1484.3994 1490.4512 1494.4336 1547.4839 1573.2956 1583.1883 1587.1457 1613.4105 1616.3099 2923.7229 2964.0792 2971.5201 2972.3139 2978.5594 3027.3668 3057.7007 3068.0929 3069.0180 3069.5090 3092.4094 3123.6397 3126.9487 3133.8804 3136.6916 3148.5646 3151.3604 3158.7699 3160.6131 3168.7665 3169.8049 3404.5127
redmass: 2.9654 3.3613 4.3093 3.8390 4.5530 2.8003 4.4024 4.1267 2.5992 6.5505 3.2469 3.2680 4.7481 1.0371 2.1775 5.1575 1.4493 4.1279 4.6842 3.5593 3.9591 3.6516 2.8279 2.8960 3.9422 2.2082 3.2246 3.5841 4.0952 5.0441 6.4161 6.4261 5.3467 1.8759 6.8965 4.0656 1.9814 4.8216 1.6797 3.0454 1.9902 2.1078 1.3719 2.3128 1.2500 1.2458 3.9307 1.2703 1.4763 1.8685 1.4803 2.2495 3.3954 1.3845 1.4074 5.9842 6.0988 5.5858 1.3708 1.3118 2.2114 2.0663 1.9026 3.8204 1.7978 1.6782 2.5627 1.9174 3.7228 2.1471 1.9820 1.0579 1.0579 2.2073 1.1536 1.1387 3.4001 1.7877 1.1626 1.4322 1.4600 1.4401 1.3566 1.3381 3.0655 1.2702 6.0367 5.5463 1.4826 1.2340 2.3408 2.3304 1.1672 1.1057 1.0538 1.0493 2.2011 1.0786 1.0518 1.0882 2.7101 8.8178 6.6990 6.1368 7.4569 6.1552 6.1761 1.0682 1.0360 1.0674 1.0462 1.0753 1.0901 1.0988 1.0940 1.0977 1.0987 1.1001 1.0847 1.0849 1.0887 1.0886 1.0934 1.0931 1.0964 1.0958 1.0998 1.1008 1.0736
irintensity: 0.4417 0.1086 0.3416 0.2183 0.2920 0.7429 0.0245 1.5785 0.5276 0.7087 3.0042 1.1947 0.1155 0.2002 1.9982 0.1579 1.4201 2.2236 0.2147 0.6063 1.2066 2.5402 0.2066 0.1662 0.3575 1.6501 5.1837 4.4411 10.2744 13.5276 0.1167 0.1183 5.2964 77.0348 15.3862 25.3547 70.0203 10.2956 16.4454 13.9837 83.2024 19.5635 2.8139 10.5264 2.0133 0.2500 6.2369 6.5794 9.6844 2.5486 5.0003 11.2126 15.3004 2.0719 1.8364 1.8967 1.2342 31.0940 1.9140 0.5181 7.7193 5.6738 12.9393 2.6264 18.5529 1.7690 24.1495 57.8113 2.0539 23.1823 14.0199 0.3860 0.0846 60.8303 3.9074 1.0816 15.2380 20.2369 0.9163 3.9546 2.2179 2.0617 0.8104 21.4329 9.0784 21.0688 0.1042 5.6635 8.4602 26.0647 13.5865 8.0355 27.6520 13.9088 7.4091 1.0150 12.7297 9.3164 16.7764 4.0287 24.0290 65.6907 6.1153 3.1708 0.0159 11.0217 10.9334 44.1596 25.8350 13.4722 27.7221 30.6202 19.9603 10.8570 8.9449 69.5091 70.9624 35.9026 1.0956 1.3957 9.4503 6.8707 44.5241 18.4310 12.7475 19.7739 21.9292 11.8253 2.4073
temp: 298.150 k
press: 1.00000 atm
elementType: 8 7 7 6 6 6 6 6 6 6 6 6 6 6 6 6 6 6 6 6 6 6 6 1 1 1 1 1 1 1 1 1 1 1 1 1 1 1 1 1 1 1 1 1 1
symmnumber: 1
zpe: 972961.3 jmol-1
zpe.correction: 0.370581 hartree
zpe.thermalcorrener: 0.391297 hartree
zpe.thermalcorrenthalpy: 0.392241 hartree
zpe.thermalcorrgfe: 0.319332 hartree
zpe.sumelectzpe: -958.385787 hartree
zpe.sumelectthermal: -958.365071 hartree
zpe.sumelectthermalent: -958.364127 hartree
zpe.sumelectthermalfe: -958.437036 hartree
dipole: 0.1429 -0.0774 -0.1965
dipole: 0.2550
quadrupole: -115.1532 -129.9079 -136.5437
quadrupole: -3.1335 3.9561 -3.1790
quadrupole: 12.0484 -2.7063 -9.3421 -3.1335 3.9561 -3.1790
hfenergy: -958.7563683 hartree
pointgroup: C01 [X(C20H22N2O1)]
dipole: 0.0513491 0.0372808 0.0777046 debye
polarizability: 311.5141819|17.1962053|302.7184817|-11.8545724|-12.6805712|136.7771423 unknown
InChI: InChI=1S/C20H22N2O/c1-15(2)21-14-13-18-22-19(16-9-5-3-6-10-16)20(23-18)17-11-7-4-8-12-17/h3-12,15,21H,13-14H2,1-2H3
charge 0 multiplicity 1
45 atoms
O  -0.4135 1.71252 0.152765
N  -5.091802 0.190473 0.183082
N  -0.691895 -0.545502 0.245917
C  -3.681869 -0.163156 -0.083641
C  -2.757641 0.941371 0.481357
C  -6.122032 -0.557505 -0.586658
C  -1.308511 0.625175 0.296727
C  0.879843 1.119755 0.01908
C  0.69471 -0.267753 0.047928
C  -7.502399 0.067543 -0.300129
C  -6.136905 -2.089123 -0.319471
C  1.999995 2.063864 -0.04437
C  1.630202 -1.392364 -0.143186
C  3.277885 1.728744 0.48642
C  1.806244 3.361881 -0.597119
C  1.280797 -2.670267 0.375785
C  2.842808 -1.261801 -0.875493
C  4.336637 2.659016 0.440882
C  2.867752 4.289284 -0.636827
C  2.134859 -3.777857 0.194961
C  3.693338 -2.372618 -1.05779
C  4.139987 3.941829 -0.124159
C  3.348882 -3.634709 -0.518019
H  -3.361639 -1.14592 0.330649
H  -3.547223 -0.223201 -1.18024
H  -2.970036 1.075326 1.562575
H  -2.993332 1.904376 -0.003812
H  -5.883486 -0.396744 -1.658031
H  -5.304695 0.173639 1.192762
H  -8.29049 -0.419425 -0.902536
H  -7.773545 -0.052449 0.767653
H  -7.490924 1.146393 -0.533435
H  -5.150715 -2.546613 -0.520642
H  -6.881388 -2.594673 -0.96327
H  -6.403475 -2.295952 0.735963
H  3.433623 0.749956 0.951289
H  0.820986 3.632948 -0.989673
H  0.330775 -2.774445 0.908971
H  3.109783 -0.299318 -1.323925
H  5.312508 2.38708 0.85838
H  2.703123 5.282966 -1.068252
H  1.852779 -4.753806 0.606196
H  4.619848 -2.255728 -1.631453
H  4.964264 4.662942 -0.156762
H  4.012173 -4.495453 -0.659646
