program: Gaussian 09
title: 000214388
version: EM64L-G09RevD.01
frameworkgroup: C1[X(C14H24N2)]
method: RPBEPBE
basis: SDD
operation: Freq
keyword: #pfreq=noraman
keyword: PBEPBE/SDD
title: #p freq=noraman PBEPBE/SDD
converged: YES YES NO NO
title: Mulliken charges:
elementType: N N C C C C C C C C C C C C C C H H H H H H H H H H H H H H H H H H H H H H H H
charge: -0.074833 -0.701336 -0.235909 -0.050735 -0.430239 -0.379187 0.601185 -0.760000 -0.727242 -0.443069 -0.410296 -0.624213 -0.620463 -0.429023 -0.444170 0.488441 0.204269 0.188181 0.218101 0.192282 0.182488 0.233005 0.212165 0.212851 0.213978 0.211568 0.215573 0.237381 0.219068 0.221924 0.184285 0.222426 0.221625 0.181363 0.233902 0.216586 0.209415 0.209287 0.299389 0.299975
chargesum: 0.00000
title: Mulliken charges with hydrogens summed into heavy atoms:
elementType: N N C C C C C C C C C C C C C C
charge: -0.074833 -0.101972 -0.031640 0.137446 -0.019856 0.036306 0.601185 -0.121006 -0.062719 -0.224001 -0.188372 0.004123 0.011388 -0.219608 -0.234883 0.488441
polarizability: 2.09680591e+02 8.82860107e+00 1.43214286e+02 -5.09032541e-01 -5.05678674e+00 1.47633573e+02
1716.lowfreq: -13.9979 -4.8619 -0.0007 -0.0006 -0.0004 6.7337 24.9524 32.5537 35.4702
frequency: 23.2093 32.2839 35.1026 44.0801 77.6797 95.2904 127.0052 167.0361 177.8675 199.2717 211.2939 224.5056 233.3175 250.1371 273.0863 292.9343 300.2482 328.3785 346.2027 353.8137 371.8268 399.1630 410.4235 416.5478 453.5836 472.0238 527.6338 544.1899 583.2235 638.9313 730.6794 743.4315 774.4355 786.0982 814.2815 822.3956 825.7903 831.2026 908.0338 934.4336 950.5863 958.8160 977.0077 984.7412 1002.7908 1008.2587 1016.7445 1024.0489 1034.2881 1057.8670 1087.4776 1097.0311 1122.6586 1131.1388 1139.1398 1156.7459 1172.0596 1189.3333 1208.1993 1241.0010 1267.4634 1273.1908 1281.5395 1298.9385 1307.8313 1309.9775 1326.6449 1345.4093 1351.3827 1359.2617 1383.5597 1386.6826 1389.7150 1416.1225 1432.5889 1437.6727 1459.7621 1462.8175 1465.8244 1472.2695 1474.3084 1475.0378 1482.6453 1483.8479 1486.9218 1490.2501 1517.5734 1582.0666 1631.0682 1642.8780 2830.5293 2842.4798 2874.1840 2937.4861 2972.3770 2974.1567 2979.3931 2981.3020 3013.9618 3017.2142 3025.1590 3033.5911 3061.8826 3068.2570 3072.9761 3074.0699 3077.6318 3077.7991 3099.3376 3107.6648 3123.9511 3134.2476 3570.1613 3711.1129
redmass: 2.7520 3.1641 3.5187 2.9281 3.3713 2.5936 2.7407 1.6118 2.1701 1.7602 1.2814 1.1945 1.5206 1.8892 2.4727 2.2648 1.3462 2.8101 2.9523 1.0523 2.5924 2.1668 2.7046 2.3298 2.8405 2.8014 2.5568 3.7324 2.3957 6.7561 2.9391 3.5186 1.2665 2.8742 1.2712 2.1656 3.9551 2.7330 1.6536 1.3837 1.3704 2.1975 1.6499 1.9945 2.5672 1.5493 1.5312 1.9548 1.5022 2.5871 1.3218 1.9283 1.4378 1.3861 1.8803 1.7929 1.8724 1.1109 2.0208 1.5376 2.3541 1.4079 1.4119 1.5679 1.7990 1.9245 1.3307 1.4397 1.3762 1.3060 1.3495 3.0261 1.2427 1.1427 2.8560 1.1824 1.0484 1.0713 1.0635 1.0784 1.0577 1.0534 1.0558 1.0543 1.0535 1.0496 3.0156 6.6000 1.8591 2.0816 1.0581 1.0590 1.0681 1.0802 1.0469 1.0493 1.0613 1.0621 1.0710 1.0705 1.0892 1.0963 1.0990 1.0983 1.0984 1.1005 1.0999 1.1002 1.0859 1.0866 1.0958 1.0967 1.0447 1.1040
irintensity: 0.0475 0.3731 0.4921 0.4176 0.7090 0.6889 1.2044 0.5141 2.0948 0.2183 0.4811 0.7207 0.4934 0.4547 4.5742 35.7477 270.6120 1.2994 6.1894 2.8456 2.0460 0.2639 0.0880 1.7114 1.7258 0.6198 3.1361 9.2475 27.5790 0.3771 4.1370 8.0211 9.2538 12.8469 0.1604 56.0156 6.2863 16.9280 0.8896 0.8605 0.3987 3.9081 2.4957 0.2323 0.3127 21.6121 12.0275 12.9406 14.2542 24.7772 4.7569 4.2992 8.9466 5.7918 6.4753 11.8085 17.3117 16.7280 2.1105 1.4800 11.0844 1.0846 2.9382 9.2805 13.3728 76.1198 4.9102 4.1574 1.0044 13.0008 5.2045 17.9212 22.6844 3.3033 0.2094 1.2044 14.6067 5.3596 3.6221 12.7542 18.7511 7.7607 14.3694 12.7121 7.1136 5.9486 133.0284 3.3297 1.0507 280.2820 77.3028 190.2336 178.4110 19.0270 28.0091 47.7761 19.4021 51.2186 34.9061 47.8651 28.9628 16.8399 40.5845 80.5191 22.7800 23.0109 85.6858 37.0062 18.5138 28.8681 44.3663 8.2189 63.8251 18.0169
temp: 298.150 k
press: 1.00000 atm
elementType: 7 7 6 6 6 6 6 6 6 6 6 6 6 6 6 6 1 1 1 1 1 1 1 1 1 1 1 1 1 1 1 1 1 1 1 1 1 1 1 1
symmnumber: 1
zpe: 925294.6 jmol-1
zpe.correction: 0.352426 hartree
zpe.thermalcorrener: 0.371191 hartree
zpe.thermalcorrenthalpy: 0.372135 hartree
zpe.thermalcorrgfe: 0.304638 hartree
zpe.sumelectzpe: -656.110595 hartree
zpe.sumelectthermal: -656.091830 hartree
zpe.sumelectthermalent: -656.090885 hartree
zpe.sumelectthermalfe: -656.158383 hartree
dipole: -1.2251 -0.5432 -0.4083
dipole: 1.4009
quadrupole: -81.0487 -102.6321 -94.2084
quadrupole: 0.9805 0.6938 -1.4701
quadrupole: 11.5810 -10.0024 -1.5787 0.9805 0.6938 -1.4701
hfenergy: -656.4630207 hartree
pointgroup: C01 [X(C14H24N2)]
dipole: -0.4921442 -0.1772269 -0.1736745 debye
polarizability: 210.6892559|3.1283932|141.8228694|1.4267629|-4.6549117|148.0163238 unknown
InChI: InChI=1S/C14H24N2/c1-5-11(2)14(10-16(3)4)12-6-8-13(15)9-7-12/h6-9,11,14H,5,10,15H2,1-4H3
charge 0 multiplicity 1
40 atoms
N  1.508397 -2.304139 0.362759
N  -4.622266 -0.016247 -0.132669
C  1.182214 0.187271 0.038747
C  1.814022 1.431854 -0.679921
C  1.731707 -1.153426 -0.545338
C  1.111591 2.770879 -0.302843
C  -0.347326 0.166451 -0.004394
C  3.340797 1.535462 -0.424698
C  1.168562 3.151581 1.194373
C  -1.114195 -0.026498 1.17024
C  -1.057492 0.288516 -1.227678
C  2.503909 -2.384191 1.446305
C  1.353545 -3.587305 -0.34647
C  -2.522474 -0.088344 1.141095
C  -2.463751 0.230705 -1.280716
C  -3.22414 0.041688 -0.090388
H  1.488572 0.236994 1.103577
H  1.668412 1.298551 -1.775463
H  1.200803 -1.35812 -1.494244
H  2.816048 -1.053526 -0.798874
H  1.579795 3.580762 -0.899818
H  0.051378 2.721544 -0.613697
H  3.899878 0.685071 -0.853215
H  3.564286 1.569137 0.658454
H  3.744615 2.460184 -0.878547
H  0.673386 4.125924 1.362752
H  2.207521 3.240407 1.561783
H  0.644642 2.404825 1.817953
H  -0.595668 -0.147381 2.129568
H  -0.504105 0.435886 -2.164692
H  3.540543 -2.604306 1.078338
H  2.218005 -3.180344 2.157503
H  2.541617 -1.431948 2.003974
H  2.273011 -3.912534 -0.900012
H  0.524304 -3.511426 -1.071643
H  1.099539 -4.382863 0.378087
H  -3.083644 -0.242942 2.071516
H  -2.9813 0.33333 -2.243341
H  -5.120778 0.07604 -1.012133
H  -5.162059 -0.156422 0.715573
