program: Gaussian 09
title: 000214301
version: EM64L-G09RevD.01
frameworkgroup: C1[X(C6H6N4O2)]
method: RPBEPBE
basis: SDD
operation: Freq
keyword: #pfreq=noraman
keyword: PBEPBE/SDD
title: #p freq=noraman PBEPBE/SDD
converged: NO YES NO YES
title: Mulliken charges:
elementType: O O N N N N C C C C C C H H H H H H
charge: -0.218838 -0.217472 -0.060866 -0.365501 0.029528 0.082834 0.356744 0.188775 -0.247797 -0.273826 -0.405922 -0.499214 0.292850 0.286294 0.293300 0.304873 0.242966 0.211272
chargesum: 0.00000
title: Mulliken charges with hydrogens summed into heavy atoms:
elementType: O O N N N N C C C C C C
charge: -0.218838 -0.217472 -0.060866 -0.060629 0.029528 0.082834 0.356744 0.188775 0.045052 0.012468 -0.112622 -0.044976
polarizability: 2.43276715e+02 -3.57462661e-01 1.00396368e+02 -1.62569726e-02 -9.96948675e-04 3.85909260e+01
1716.lowfreq: -6.5191 -0.0006 -0.0003 0.0005 4.5873 8.0828 58.3294 70.1816 124.4067
frequency: 58.2474 70.1520 124.4055 152.9730 187.0055 234.4689 287.2446 306.2775 421.2527 421.3618 491.4791 496.0814 522.1714 621.0381 660.9646 672.8529 678.8928 751.4673 765.2241 771.5505 853.3331 861.3547 952.7344 953.1376 980.3118 1003.4559 1054.4788 1101.9191 1127.4426 1165.6576 1221.8271 1256.1209 1296.0127 1347.6687 1366.7438 1402.3876 1423.2945 1457.7862 1525.1100 1561.8505 1584.6390 1595.6592 3021.0475 3174.6666 3179.8197 3201.2233 3203.6520 3390.1016
redmass: 7.0950 6.9593 5.2557 5.6841 2.5446 6.6671 6.5834 7.2608 3.8824 3.8574 7.4145 2.8310 6.8707 8.5136 1.2193 7.1825 4.3696 1.4768 4.2534 8.8451 4.3912 1.4541 1.3874 1.4236 3.5558 1.3214 3.4434 2.1021 1.6398 1.7993 8.4508 1.8140 1.4925 7.1951 5.5059 3.3182 1.8267 1.7901 2.2738 5.7145 4.9711 6.5364 1.0653 1.0930 1.0903 1.0974 1.1069 1.0753
irintensity: 0.0992 0.0261 1.4427 5.0441 21.4980 4.7760 1.7116 0.4307 13.9577 2.0313 10.7731 14.0595 3.7823 1.7920 98.4522 0.9891 0.0385 0.3803 14.1804 24.0142 7.4849 40.7573 59.6730 43.5365 10.5517 0.2571 59.8241 39.4370 49.2384 162.0582 658.0602 23.2959 19.7055 86.6166 9.4596 54.9886 53.9304 27.4781 106.9987 38.6222 231.3171 393.7485 26.0741 0.4496 1.1076 0.4561 6.7377 23.7111
temp: 298.150 k
press: 1.00000 atm
elementType: 8 8 7 7 7 7 6 6 6 6 6 6 1 1 1 1 1 1
symmnumber: 1
zpe: 328725.1 jmol-1
zpe.correction: 0.125205 hartree
zpe.thermalcorrener: 0.135432 hartree
zpe.thermalcorrenthalpy: 0.136376 hartree
zpe.thermalcorrgfe: 0.088668 hartree
zpe.sumelectzpe: -600.701391 hartree
zpe.sumelectthermal: -600.691164 hartree
zpe.sumelectthermalent: -600.690220 hartree
zpe.sumelectthermalfe: -600.737928 hartree
dipole: 7.2932 0.1818 0.0013
dipole: 7.2955
quadrupole: -71.5539 -68.2823 -70.1817
quadrupole: 2.4680 0.0291 -0.0012
quadrupole: -1.5480 1.7237 -0.1757 2.4680 0.0291 -0.0012
hfenergy: -600.8265962 hartree
pointgroup: C01 [X(C6H6N4O2)]
dipole: -2.8689551 0.0862933 -0.0005305 debye
dipolederiv: -0.8166762 0.2009886 0.0000457 0.4814602 -0.730451 0.000177 0.0006364 -0.0004395 -0.2463887 -0.9396998 -0.1924034 0.0000164 -0.4526171 -0.6268115 -0.0001922 0.0006695 0.0003369 -0.2380695 -1.207019 0.0798495 0.0000826 -0.5323064 -0.3039707 0.0000302 0.0002499 0.0000051 -0.2619483 -1.8859175 0.0574344 0.00013 -0.6630554 -0.053292 -0.000037 -0.0001313 -0.0000246 -0.3087608 2.4127457 -0.0860928 -0.0003554 -0.1184992 1.0954876 0.0000427 -0.0010667 0.000093 0.2067762 0.8290886 0.233126 -0.0005077 1.1641938 -0.0843025 0.0000912 -0.0007593 -0.0001216 -0.0777203 -1.3341738 0.1167311 0.0002581 0.0316107 -0.2653796 -0.0000262 0.0000749 0.0000076 0.0544727 2.2971112 -0.0868447 -0.0001702 -0.4324047 0.1983693 0.0000174 0.0000141 0.0000393 0.1786267 0.6980376 -0.0040104 -0.0000329 0.3007237 0.1131824 -0.0000669 -0.0001976 0.0000314 -0.0654888 -0.7066529 0.0699199 0.0000341 0.7093311 -0.1089715 -0.0000208 -0.0000617 -0.0000286 -0.1413203 0.7698115 -0.154034 -0.0000374 -0.2337005 0.3051246 0.0000747 -0.0002579 -0.0000108 -0.0117727 -0.458592 -0.1546121 0.0011664 -0.0925927 0.3559148 -0.0002865 0.00405 -0.0000798 -0.3126391 0.1106592 0.0567674 -0.0000061 0.0069203 0.0617897 0.0000125 0.0000132 -0.0000074 0.1615987 0.0850918 -0.0551089 0.0000068 -0.0569186 0.0397693 -0.0000074 0.000046 -0.000008 0.172676 0.0655309 -0.0532382 -0.0000056 -0.041612 0.0735487 -0.0000092 0.0000143 -0.0000004 0.1381776 0.0683628 0.0016703 0.0000267 -0.1256344 0.0751807 0.0000231 -0.0000949 0.0001216 0.3442069 -0.0082337 -0.0397468 -0.0003191 -0.0427414 0.0045317 -0.0000906 -0.001704 -0.000318 0.1777111 0.0205258 0.0096042 -0.0003325 0.0978426 -0.14972 0.0002678 -0.001495 0.000404 0.2298627 unknown
polarizability: 243.2766076|-0.3783711|100.3964754|-0.0162516|0.0010807|38.590926 unknown
InChI: InChI=1S/C6H6N4O2/c1-7-9-6-3-2-5(4-8-6)10(11)12/h2-4,9H,1H2
charge 0 multiplicity 1
18 atoms
O  3.48145 -1.324142 -0.000862
O  3.662612 0.956473 -0.000838
N  -0.451621 1.409646 0.000151
N  -2.591071 0.53065 0.000252
N  2.965573 -0.135341 0.000182
N  -3.498679 -0.505329 0.000331
C  1.504105 -0.020735 0.000183
C  -1.223937 0.275231 0.000162
C  0.701187 -1.190386 0.000182
C  -0.690866 -1.04833 0.000193
C  0.894484 1.256557 0.000164
C  -4.775993 -0.213742 -0.00003
H  1.181894 -2.171988 0.000196
H  -1.36836 -1.903706 0.000215
H  1.50642 2.162727 0.000169
H  -2.870641 1.524497 0.000145
H  -5.471257 -1.056799 -0.002175
H  -5.1866 0.811217 -0.001522
