program: Gaussian 09
title: 000214300
version: EM64L-G09RevD.01
frameworkgroup: C1[X(C12H15ClN2O2)]
method: RPBEPBE
basis: SDD
operation: Freq
keyword: #p
keyword: freq=noraman
keyword: PBEPBE/SDD
title: #p freq=noraman PBEPBE/SDD
converged: YES YES NO NO
title: Mulliken charges:
elementType: Cl O O N N C C C C C C C C C C C C H H H H H H H H H H H H H H H
charge: -0.056706 -0.339956 -0.300705 -0.392099 -0.577728 0.074512 -0.353306 0.327659 0.159890 -0.373428 -0.313739 -0.281231 -0.267235 -0.122902 -0.337432 -0.079786 -0.535186 0.235684 0.228003 0.367409 0.196201 0.228458 0.290227 0.271345 0.260863 0.224642 0.226501 0.276347 0.269492 0.239656 0.229548 0.225003
chargesum: 0.00000
title: Mulliken charges with hydrogens summed into heavy atoms:
elementType: Cl O O N N C C C C C C C C C C C C
charge: -0.056706 -0.339956 -0.300705 -0.024690 -0.031889 0.074512 0.110382 0.327659 0.159890 0.051231 -0.023512 -0.009886 -0.006372 -0.122902 0.113711 0.159870 -0.080635
polarizability: 2.30795803e+02 -1.32374719e+01 1.84781631e+02 5.38166382e+00 -3.68933288e+00 8.93211111e+01
1716.lowfreq: -11.3688 -3.9736 -0.0028 -0.0023 -0.0016 7.5024 19.2978 32.3908 44.2676
frequency: 17.3725 32.3847 44.2296 58.0908 70.0948 88.3069 95.7578 111.6347 125.8377 144.9436 203.0707 207.5764 230.1372 260.1410 278.3212 293.2225 311.6848 332.6059 351.7966 419.9891 444.7977 451.4987 515.3755 555.5410 573.3710 597.5069 616.4654 644.1167 663.3244 685.0370 706.6974 751.2156 756.3098 826.2017 835.0266 837.2105 857.5721 920.9729 948.0525 958.1990 971.8418 986.0019 988.8522 1006.7527 1010.2433 1068.3087 1085.9682 1100.3932 1102.5575 1149.0989 1154.1810 1180.6558 1198.9229 1225.1081 1252.1495 1263.8634 1268.6333 1283.5499 1300.3445 1343.4903 1346.1484 1377.0749 1378.4244 1390.2772 1433.3826 1445.2373 1460.9395 1477.0762 1486.5573 1522.4516 1564.0279 1582.1104 1611.8316 1640.9348 1666.2676 2925.0300 2962.6473 3012.2742 3025.6810 3036.9922 3085.1218 3096.5200 3121.1104 3152.9405 3181.4958 3186.1599 3207.3865 3459.5597 3463.5463 3590.6537
redmass: 3.3618 6.9155 4.5376 3.4165 3.5765 2.4790 6.9449 2.4909 3.3351 4.8332 4.3186 1.5883 2.4803 4.3153 4.6259 4.0737 4.4644 4.1504 5.3264 4.4590 3.2531 3.2801 4.2109 3.8202 5.9019 4.8420 1.3200 2.3011 4.1655 3.4600 1.1626 3.5512 1.7672 2.0885 1.6053 1.4261 5.0674 1.7085 1.8767 3.1509 1.4175 1.6737 1.3316 3.9198 1.2519 2.5046 2.2000 2.3252 2.5919 1.6699 1.9311 1.5940 4.2506 1.2341 1.7112 1.2886 1.6840 1.2366 1.1062 1.3474 1.2586 4.3682 1.4920 3.7905 1.1991 1.1224 2.1423 1.2071 1.0864 1.8530 7.9298 7.1087 6.1987 1.0950 4.7189 1.0679 1.0575 1.0609 1.0911 1.1052 1.1060 1.0606 1.0952 1.0895 1.0955 1.0919 1.1147 1.0802 1.0452 1.0976
irintensity: 0.8050 1.1894 0.4321 0.1270 1.5793 4.2384 2.4789 1.2828 2.3351 8.0753 3.6201 29.5590 31.4689 1.5367 3.8445 2.4159 1.0100 11.8689 8.9060 29.7640 9.8772 2.8085 10.0930 13.1537 0.6696 18.6562 209.1046 10.5904 28.8918 6.0745 87.6708 20.3822 5.6778 2.1920 11.4420 46.7866 91.9391 13.0265 5.9412 173.0408 58.2516 12.2615 2.1876 8.1359 15.4224 4.5058 13.9024 50.0240 26.6420 1.6140 17.1824 9.4522 168.1389 2.1080 14.6118 1.6046 84.7011 0.5529 0.7860 10.8768 5.9544 3.9073 7.1270 44.4432 35.2551 25.7985 129.4385 13.1147 6.0482 253.1615 6.5371 160.3792 221.9425 37.6828 1.9723 61.7746 31.3180 40.2427 30.7359 21.4831 23.6882 8.0974 7.7583 2.9595 3.3517 2.3488 18.5992 153.4389 0.1794 0.9063
temp: 298.150 k
press: 1.00000 atm
elementType: 17 8 8 7 7 6 6 6 6 6 6 6 6 6 6 6 6 1 1 1 1 1 1 1 1 1 1 1 1 1 1 1
symmnumber: 1
zpe: 661848.7 jmol-1
zpe.correction: 0.252085 hartree
zpe.thermalcorrener: 0.270156 hartree
zpe.thermalcorrenthalpy: 0.271100 hartree
zpe.thermalcorrgfe: 0.203184 hartree
zpe.sumelectzpe: -1184.990276 hartree
zpe.sumelectthermal: -1184.972205 hartree
zpe.sumelectthermalent: -1184.971261 hartree
zpe.sumelectthermalfe: -1185.039177 hartree
dipole: -0.5131 4.8084 1.2691
dipole: 4.9995
quadrupole: -109.6465 -98.6865 -107.9220
quadrupole: -0.3538 -7.4598 -1.9438
quadrupole: -4.2282 6.7318 -2.5036 -0.3538 -7.4598 -1.9438
hfenergy: -1185.2423613 hartree
pointgroup: C01 [X(C12H15Cl1N2O2)]
dipole: 0.072869 1.9637371 0.0855453 debye
polarizability: 227.6415739|12.4399317|176.0234606|15.7541852|31.3509342|101.2335113 unknown
InChI: InChI=1S/C12H15ClN2O2/c1-2-7-17-11-8-9(13)3-4-10(11)12(16)15-6-5-14/h2-4,8,15H,1,5-7,14H2
charge 0 multiplicity 1
32 atoms
Cl -5.019129 -0.916648 -0.685372
O  -0.321758 1.120404 0.444664
O  1.553453 -2.656157 -0.19332
N  1.857076 -0.454182 0.485249
N  5.549007 -0.588948 -0.342741
C  -0.415456 -1.241159 -0.111534
C  3.303335 -0.618287 0.681652
C  -1.096407 0.00184 0.078572
C  1.070472 -1.49923 0.050469
C  4.116468 -0.361626 -0.612827
C  -1.192046 -2.364439 -0.488195
C  -2.499242 0.096462 -0.09546
C  -2.587191 -2.29748 -0.672631
C  -3.213629 -1.056102 -0.467032
C  -0.99298 2.435724 0.616407
C  0.083432 3.457887 0.861082
C  0.127461 4.25596 1.955438
H  3.486701 -1.654893 1.0182
H  3.650314 0.073046 1.469283
H  1.403371 0.451293 0.649442
H  3.984462 0.692477 -0.922309
H  3.690403 -1.001873 -1.418223
H  -0.646211 -3.302876 -0.632233
H  -3.036112 1.034558 0.057038
H  -3.164935 -3.178149 -0.962926
H  -1.551193 2.664976 -0.314807
H  -1.701954 2.380719 1.464838
H  6.185873 -0.165673 -1.022954
H  5.783668 -1.569278 -0.157168
H  0.842698 3.550771 0.072845
H  0.907748 5.014531 2.078296
H  -0.615997 4.17765 2.758256
