program: Gaussian 09
title: 000214267
version: EM64L-G09RevD.01
frameworkgroup: C1[X(C11H16N2O)]
method: RPBEPBE
basis: SDD
operation: Freq
keyword: #p
keyword: freq=noraman
keyword: PBEPBE/SDD
title: #p freq=noraman PBEPBE/SDD
converged: YES YES NO NO
title: Mulliken charges:
elementType: O N N C C C C C C C C C C C H H H H H H H H H H H H H H H H
charge: -0.439892 -0.151818 -0.043246 0.412393 0.454314 -0.357466 -0.340195 -0.406224 -0.398006 -0.646274 -0.646382 -0.365569 -0.486292 -0.312228 0.235572 0.235704 0.217941 0.269741 0.235523 0.216999 0.235180 0.216357 0.236355 0.236686 0.197423 0.242068 0.202725 0.224134 0.192791 0.331686
chargesum: 0.00000
title: Mulliken charges with hydrogens summed into heavy atoms:
elementType: O N N C C C C C C C C C C C
charge: -0.108206 -0.151818 -0.043246 0.412393 0.454314 -0.121894 -0.104491 -0.188283 -0.128265 0.041428 0.043016 -0.168146 -0.041499 0.104698
polarizability: 2.73352224e+02 1.21099849e+01 1.29633390e+02 1.07986789e-02 -1.39515541e+00 7.59118623e+01
1716.lowfreq: -10.9826 -9.4159 -0.0012 -0.0010 -0.0009 3.1224 33.1813 58.4053 65.3315
frequency: 33.0790 58.2606 65.3159 79.4778 100.5371 111.6027 157.0778 160.6491 193.5706 207.5739 230.2566 258.8724 275.0034 320.6862 369.9150 388.0955 422.4419 427.1036 481.2141 496.5050 524.7666 599.1067 632.1595 728.7588 735.5740 774.4522 805.9656 827.8825 852.6861 933.4893 940.5221 960.4119 965.5359 975.5617 987.1545 995.9523 1028.0040 1057.2513 1070.8675 1108.3489 1111.0643 1125.5714 1161.8471 1164.5637 1188.2325 1252.4549 1259.0054 1268.0704 1287.0418 1313.9025 1341.1870 1360.7202 1362.9454 1376.7396 1397.3358 1429.3821 1443.0235 1447.1864 1460.4712 1465.0456 1476.2585 1479.6006 1491.7009 1504.8033 1530.8645 1556.7615 1616.0076 1635.3677 2933.1209 2941.2844 2948.5814 2949.7642 2953.7566 3006.0784 3006.9102 3011.2358 3074.6716 3095.8802 3105.9576 3108.6457 3143.5790 3163.5526 3167.3573 3553.9758
redmass: 4.7940 2.7464 5.3033 2.3865 2.1561 1.7019 4.0263 2.4564 1.2761 2.0597 3.7406 2.4483 2.6420 1.3199 3.8886 3.6522 4.3912 3.0300 3.4411 4.2323 2.2390 4.6311 7.1511 4.8798 2.8542 1.2265 1.3238 1.6272 4.9718 1.3546 3.1107 3.3827 1.7243 5.2786 1.3907 2.8500 3.4059 1.4929 1.6428 1.2395 1.3207 1.4070 1.2195 1.6745 1.1415 2.0167 2.8878 1.2073 1.1198 1.5113 1.3548 1.7418 3.7264 1.5572 1.8472 1.4135 1.4310 1.5329 1.2257 1.0397 1.0457 1.0839 1.0934 1.1277 2.6646 6.7724 5.7111 6.4171 1.0818 1.0369 1.0589 1.0463 1.0711 1.0927 1.1000 1.1023 1.0961 1.0963 1.0941 1.0895 1.0872 1.0935 1.0948 1.0661
irintensity: 0.6270 2.6206 0.5439 1.2142 5.5461 2.9958 2.6425 1.1442 7.0994 24.6701 0.2533 5.0601 13.8780 145.9277 14.4907 2.5381 4.2031 0.5991 6.2652 8.7400 21.7933 1.7951 0.5666 4.1011 0.1084 11.2404 13.6267 55.9302 3.8801 6.9962 26.3453 34.8199 15.6231 109.5579 5.9462 0.8995 5.6588 26.4138 14.0112 0.0524 1.2138 4.9698 34.6160 3.3172 87.9138 14.4856 28.9023 3.2023 19.7681 11.2387 132.0586 5.6130 199.7297 1.8921 1.7956 9.5454 3.0850 12.9632 14.1741 0.0118 21.9580 1.4732 1.9445 42.8104 224.2162 38.1038 429.2053 108.1760 57.9960 109.1389 149.2327 39.3710 61.5796 23.6430 19.2624 70.6010 32.6222 4.7689 50.5090 12.4393 2.8679 24.7489 13.2614 11.2718
temp: 298.150 k
press: 1.00000 atm
elementType: 8 7 7 6 6 6 6 6 6 6 6 6 6 6 1 1 1 1 1 1 1 1 1 1 1 1 1 1 1 1
symmnumber: 1
zpe: 658025.0 jmol-1
zpe.correction: 0.250629 hartree
zpe.thermalcorrener: 0.265775 hartree
zpe.thermalcorrenthalpy: 0.266719 hartree
zpe.thermalcorrgfe: 0.207553 hartree
zpe.sumelectzpe: -612.389600 hartree
zpe.sumelectthermal: -612.374453 hartree
zpe.sumelectthermalent: -612.373509 hartree
zpe.sumelectthermalfe: -612.432675 hartree
dipole: 4.8815 0.5010 1.2911
dipole: 5.0741
quadrupole: -71.0353 -79.8347 -87.5759
quadrupole: 3.8740 -8.8071 -0.4836
quadrupole: 8.4467 -0.3527 -8.0939 3.8740 -8.8071 -0.4836
hfenergy: -612.6402281 hartree
pointgroup: C01 [X(C11H16N2O1)]
dipole: 1.8942602 -0.4615775 0.4289323 debye
polarizability: 273.5850534|-8.6784118|97.3002224|8.8489295|25.4565766|108.0122003 unknown
InChI: InChI=1S/C11H16N2O/c1-13(2)11-5-3-10(4-6-11)9-12-7-8-14/h3-6,9,14H,7-8H2,1-2H3
charge 0 multiplicity 1
30 atoms
O  -6.203283 0.879803 0.425288
N  3.829756 -0.355363 -0.087681
N  -2.694445 -0.254034 -0.715018
C  2.44312 -0.190822 -0.038333
C  -0.416395 0.141732 0.057618
C  1.828187 0.640001 0.95379
C  1.583435 -0.848567 -0.982998
C  0.432295 0.794518 0.991607
C  0.193729 -0.682012 -0.929936
C  4.688419 0.339594 0.879731
C  4.435955 -1.211696 -1.115801
C  -1.874643 0.325341 0.127191
C  -4.152453 -0.049052 -0.631772
C  -4.739202 0.778399 0.537019
H  2.440199 1.164343 1.692639
H  2.009927 -1.489429 -1.759944
H  -0.012048 1.437952 1.762835
H  -0.458839 -1.18403 -1.652313
H  4.580271 1.441251 0.80945
H  5.742342 0.089645 0.680543
H  4.459432 0.040631 1.922954
H  5.529032 -1.226554 -0.981873
H  4.223079 -0.842582 -2.139725
H  4.070927 -2.256376 -1.047392
H  -2.212202 0.995305 0.948031
H  -4.478024 0.416922 -1.583937
H  -4.615437 -1.060424 -0.623211
H  -4.391185 1.824682 0.502544
H  -4.444373 0.341489 1.5161
H  -6.588676 -0.033363 0.429795
