program: Gaussian 09
title: 000214345
version: EM64L-G09RevD.01
frameworkgroup: C1[X(C22H30BrClNO)]
method: RPBEPBE
basis: SDD
operation: Freq
keyword: #p
keyword: freq=noraman
keyword: PBEPBE/SDD
title: #p freq=noraman PBEPBE/SDD
converged: YES YES NO NO
title: Mulliken charges:
elementType: Br Cl O N C C C C C C C C C C C C C C C C C C C C C C H H H H H H H H H H H H H H H H H H H H H H H H H H H H H H
charge: 0.109069 -0.039409 -0.280548 -0.098102 -0.326126 -0.554946 -0.447347 -0.580373 -0.561956 0.469468 -0.275608 -0.365108 -0.362128 0.153486 0.435653 -0.234531 -0.179372 -0.178402 -0.568593 -0.361890 -0.236991 -0.686802 -0.687566 0.570401 -0.364425 -0.798621 0.252710 0.282474 0.279648 0.277671 0.247804 0.243731 0.273728 0.288997 0.256828 0.277937 0.261136 0.268005 0.209975 0.204716 0.245789 0.247964 0.231932 0.273071 0.273844 0.243109 0.267226 0.220631 0.217903 0.221918 0.219646 0.218075 0.222162 0.254697 0.212567 0.254869
chargesum: 1.00000
title: Mulliken charges with hydrogens summed into heavy atoms:
elementType: Br Cl O N C C C C C C C C C C C C C C C C C C C C C C
charge: 0.109069 -0.039409 -0.280548 -0.098102 0.209058 0.002374 0.044188 0.239179 0.245122 0.469468 0.139083 -0.119319 -0.114164 0.153486 0.435653 -0.002599 0.093699 0.095442 -0.325484 -0.094663 -0.236991 -0.026351 -0.027682 0.570401 -0.364425 -0.076487
polarizability: 3.17164704e+02 -1.86282486e+01 3.24441588e+02 1.51052289e+01 1.28331745e+01 1.93493751e+02
1716.lowfreq: -8.4771 -6.3116 0.0011 0.0015 0.0016 0.4161 5.2154 8.4667 12.2254
frequency: -5.8770 8.3473 12.0995 19.5505 34.6298 46.5417 57.2478 70.4114 82.6870 93.1062 108.8712 121.6270 123.0394 130.4848 137.4417 146.8359 179.0837 200.8892 207.3815 218.6993 220.0900 233.3531 237.4254 248.2976 260.8313 266.7100 288.3278 289.5245 301.8201 337.5322 350.5175 358.7434 382.9301 402.6185 406.8067 408.8032 415.8643 451.1724 455.5930 483.2182 485.2468 496.8160 552.8526 583.9472 619.9330 626.7998 628.7443 642.0536 701.0111 714.6073 734.8182 740.4246 753.1227 775.9349 795.7267 819.2545 839.8786 841.4771 850.8936 883.3790 885.0680 893.0382 896.6090 919.9826 948.9488 954.6341 960.1656 968.3124 972.8017 977.8161 1000.2442 1005.3964 1026.4854 1043.3075 1064.9623 1065.4135 1067.1146 1069.2667 1077.2168 1093.4949 1113.8749 1114.6166 1122.8899 1150.6364 1158.0719 1177.7776 1194.9112 1196.1168 1199.2233 1219.7382 1224.5399 1253.2956 1265.7334 1268.6529 1286.5313 1292.2821 1302.7815 1313.0367 1317.1589 1319.9162 1349.3096 1372.0076 1375.6638 1379.4034 1380.5095 1381.0299 1390.7351 1399.9342 1400.2350 1404.2955 1419.8197 1441.8552 1456.0351 1458.9813 1463.3778 1465.4659 1465.7998 1468.6879 1472.5078 1472.5744 1476.2127 1477.2211 1479.7081 1480.9861 1488.6973 1492.1795 1493.4759 1497.3557 1571.4074 1574.3283 1596.3578 1611.2329 2936.0988 2977.7395 2980.2398 2986.7675 2990.2722 3010.6656 3019.9142 3024.4986 3026.2210 3028.1951 3031.7768 3068.9382 3072.2027 3074.2017 3078.1907 3080.2185 3083.8423 3091.8881 3096.4420 3099.1373 3127.8536 3131.6429 3139.8236 3143.9043 3144.0703 3153.1887 3155.7466 3156.7433 3176.0970 3178.6960
redmass: 4.5036 2.8594 7.3134 6.0921 4.7891 4.3737 3.7281 3.5657 3.0309 2.4481 3.3171 1.5288 1.7536 3.5943 3.2129 4.3467 5.1192 1.1508 4.2874 1.9657 1.7622 1.5809 2.0782 2.3248 3.3024 1.1128 4.2392 3.6303 3.3745 4.5381 3.4677 3.8486 2.4426 3.8975 2.7966 2.8708 2.5890 3.7078 2.7746 3.3985 3.5844 3.5263 3.0080 3.8833 5.0580 6.6718 5.1428 5.1754 4.1821 5.8042 3.0687 3.6607 3.7884 1.1265 3.0309 3.8826 1.4960 1.2541 1.8888 2.1559 1.6031 1.4582 2.1935 1.1802 4.0984 1.4443 1.9925 1.5812 1.9060 1.3745 4.3265 1.5091 4.5178 1.5169 1.9406 2.8459 1.3280 2.6097 3.1508 1.3821 2.7001 2.8434 1.3861 1.4333 2.0001 1.3469 1.8401 1.1205 1.5718 1.5305 2.5408 1.8600 1.3692 2.5252 1.1569 1.2696 1.2586 1.3445 1.3053 1.8834 1.3281 1.5008 4.0902 3.3735 1.2162 2.1409 1.5781 1.2344 2.9293 1.2643 1.1479 1.1521 1.0798 1.0440 1.0717 1.0635 1.0461 1.0509 1.1737 1.1898 1.2215 1.9847 1.0739 1.2120 1.0961 1.0687 1.2179 1.3389 6.8447 6.5302 6.0728 7.7128 1.0547 1.0350 1.0354 1.0367 1.1070 1.0604 1.0577 1.0561 1.0847 1.0344 1.0343 1.0973 1.1000 1.1040 1.1007 1.0993 1.0990 1.1001 1.1073 1.1062 1.0906 1.0910 1.1048 1.0924 1.1020 1.1044 1.0919 1.1048 1.0949 1.0961
irintensity: 1.5089 0.1163 0.9820 0.1701 0.0079 0.5710 0.4232 0.6049 3.8474 0.6758 1.0951 0.4956 0.0339 3.1707 2.2094 1.0059 2.6275 0.0634 0.6062 0.6137 0.0827 1.7866 3.0153 1.3197 0.4802 0.8064 0.5401 0.7032 0.7602 1.4422 3.4365 0.2176 0.1602 3.6768 1.7344 0.1454 0.0024 4.7712 1.9277 4.3366 16.7757 0.7953 8.2746 5.2347 18.8420 1.4548 0.2534 4.2444 18.6075 5.2777 1.1327 22.8019 21.9256 13.4290 166.3264 41.5668 12.2669 0.7297 28.2225 0.4443 4.4649 15.3388 21.9842 1.7608 9.8200 0.3490 6.0327 4.8749 2.4774 0.0494 39.4587 14.4969 27.7252 8.7548 110.4421 50.3621 1.1871 9.1241 2.9332 0.5770 21.8225 105.3339 6.2159 0.9210 114.5086 4.5545 10.6692 1.4203 2.1910 2.1853 26.1362 72.9077 3.0728 20.9993 6.9456 14.2935 1.1475 5.2836 1.9592 62.4816 18.9436 8.1508 39.0962 0.8179 16.7359 4.4450 31.4450 21.3301 11.1722 15.7839 25.4881 24.5621 1.6944 13.1288 4.7772 4.8353 0.1760 5.8459 47.7489 17.7132 47.9270 18.9137 3.2740 25.7101 18.3783 48.8730 120.6099 12.9042 0.0547 1.8105 97.7839 4.7705 50.9738 30.7226 29.0237 17.6261 27.0535 2.6466 15.2707 7.4241 2.8002 7.1350 6.7332 9.4040 1.7079 3.3823 23.2349 77.4340 47.4510 18.2208 3.9859 16.2411 8.7141 9.2810 2.8680 30.7446 2.0592 2.4552 0.9831 4.0522 0.7431 0.2345
temp: 298.150 k
press: 1.00000 atm
elementType: 35 17 8 7 6 6 6 6 6 6 6 6 6 6 6 6 6 6 6 6 6 6 6 6 6 6 1 1 1 1 1 1 1 1 1 1 1 1 1 1 1 1 1 1 1 1 1 1 1 1 1 1 1 1 1 1
symmnumber: 1
zpe: 1233294.5 jmol-1
zpe.correction: 0.469737 hartree
zpe.thermalcorrener: 0.497799 hartree
zpe.thermalcorrenthalpy: 0.498743 hartree
zpe.thermalcorrgfe: 0.406908 hartree
zpe.sumelectzpe: -1457.613575 hartree
zpe.sumelectthermal: -1457.585513 hartree
zpe.sumelectthermalent: -1457.584569 hartree
zpe.sumelectthermalfe: -1457.676404 hartree
dipole: 11.4372 12.0336 -2.5826
dipole: 16.8014
quadrupole: -136.2634 -121.5360 -160.8927
quadrupole: 18.1429 -2.7155 -0.5022
quadrupole: 3.3007 18.0280 -21.3287 18.1429 -2.7155 -0.5022
hfenergy: -1458.0833121 hartree
pointgroup: C01 [X(C22H30Br1Cl1N1O1)]
dipole: -5.0252136 3.9880407 1.5928452 debye
polarizability: 312.1494847|13.9932323|328.0876923|22.4084755|12.8275769|194.8628664 unknown
InChI: InChI=1S/C22H30BrClNO/c1-16(2)20-14-21(24)17(3)13-22(20)26-12-6-11-25(4,5)15-18-7-9-19(23)10-8-18/h7-10,13-14,16H,6,11-12,15H2,1-5H3
charge 1 multiplicity 1
56 atoms
Br -6.546421 -3.592404 -1.656803
Cl 6.853154 -2.70696 -0.164364
O  1.94372 0.791523 0.038865
N  -2.829838 2.038679 0.691074
C  -1.734598 0.948747 0.758649
C  -4.185435 1.447272 1.26245
C  -0.329262 1.408451 0.341796
C  -3.036329 2.509881 -0.743062
C  -2.455899 3.231715 1.566014
C  -4.723183 0.238171 0.537697
C  0.65352 0.222615 0.402514
C  -4.404052 -1.073317 0.982177
C  -5.622923 0.386202 -0.552201
C  3.070988 -0.080512 0.008527
C  4.310197 0.526186 -0.332463
C  4.434066 2.019292 -0.647127
C  -4.936161 -2.209014 0.33776
C  -6.161327 -0.739885 -1.208329
C  2.972903 -1.461529 0.295669
C  5.443421 -0.318962 -0.373323
C  -5.806386 -2.033518 -0.762467
C  4.885752 2.248042 -2.114964
C  5.395154 2.728485 0.344289
C  4.111106 -2.306476 0.253945
C  5.336974 -1.691375 -0.087733
C  4.000501 -3.784806 0.560733
H  -1.73163 0.592597 1.805361
H  -2.088946 0.124291 0.117154
H  -3.962713 1.224275 2.320164
H  -4.890797 2.294961 1.219718
H  0.062551 2.194975 1.010498
H  -0.309965 1.799345 -0.691145
H  -2.115907 2.989033 -1.104859
H  -3.286851 1.645958 -1.374609
H  -3.860323 3.239982 -0.761207
H  -1.574886 3.736151 1.145791
H  -3.303452 3.93391 1.591711
H  -2.232613 2.878597 2.584463
H  0.359386 -0.576009 -0.311865
H  0.691787 -0.214115 1.424057
H  -3.755366 -1.219437 1.854601
H  -5.931418 1.384886 -0.884421
H  3.432481 2.469925 -0.527874
H  -4.691273 -3.213421 0.693651
H  -6.857605 -0.614327 -2.041865
H  2.01358 -1.919245 0.55789
H  6.421307 0.099872 -0.63018
H  5.892295 1.827896 -2.295212
H  4.929954 3.329697 -2.339222
H  4.189808 1.773107 -2.829785
H  6.42305 2.329877 0.263453
H  5.439664 3.811531 0.12699
H  5.064457 2.597365 1.390372
H  4.648675 -4.065672 1.410619
H  2.962744 -4.065032 0.808243
H  4.329861 -4.395873 -0.299221
