program: Gaussian 09
title: 000214268
version: EM64L-G09RevD.01
frameworkgroup: C1[X(C13H21N5O)]
method: RPBEPBE
basis: SDD
operation: Freq
keyword: #p
keyword: freq=noraman
keyword: PBEPBE/SDD
title: #p freq=noraman PBEPBE/SDD
converged: YES YES NO NO
title: Mulliken charges:
elementType: O N N N N N C C C C C C C C C C C C C H H H H H H H H H H H H H H H H H H H H H
charge: -0.263457 -0.123191 -0.166092 -0.157662 -0.104249 -0.013740 -0.458938 0.164781 0.061241 0.137148 -0.314724 -0.301741 -0.644492 -0.035882 0.125293 -0.682798 -0.681903 -0.629844 -0.761424 0.214340 0.233429 0.237556 0.185781 0.211221 0.184664 0.229291 0.266875 0.292669 0.228719 0.206858 0.214450 0.225291 0.210586 0.217474 0.236581 0.236093 0.284076 0.225988 0.282212 0.227519
chargesum: 0.00000
title: Mulliken charges with hydrogens summed into heavy atoms:
elementType: O N N N N N C C C C C C C C C C C C C
charge: -0.263457 -0.123191 -0.166092 -0.157662 -0.104249 -0.013740 -0.011168 0.164781 0.061241 0.137148 0.108613 0.094145 0.144343 -0.035882 0.125293 -0.032771 -0.028552 0.126906 -0.025705
polarizability: 2.38502251e+02 -8.73343968e+00 1.85730585e+02 1.17182852e+01 9.20409539e+00 1.27076859e+02
1716.lowfreq: -12.2492 -7.0498 -4.5177 -0.0008 -0.0007 -0.0007 23.2214 36.0739 43.6860
frequency: 22.2692 36.0427 43.6829 66.3279 72.0777 81.7881 92.9329 117.7779 134.9630 146.1170 169.2404 182.8798 186.0737 212.7942 227.4079 236.3350 241.8489 271.5643 284.8147 304.6070 313.4311 314.7883 358.7454 388.5363 395.6003 431.6810 457.1054 479.0388 519.1605 582.1658 610.8609 636.3393 658.6539 665.6714 682.5843 729.6915 756.2179 777.6083 793.2570 799.6462 810.7921 902.5299 920.0648 964.7225 982.4044 988.3657 1029.9349 1042.7947 1059.1706 1070.6802 1073.0528 1086.1217 1109.4675 1118.9673 1135.2370 1137.7140 1157.6815 1166.5872 1193.1427 1216.4068 1233.4205 1256.1489 1280.4262 1288.0216 1313.5184 1340.0521 1355.7339 1363.9607 1373.2171 1385.9721 1386.9393 1389.5013 1391.0245 1434.9045 1438.4331 1445.7644 1455.5283 1464.3667 1465.6721 1467.5404 1468.2682 1469.9985 1473.6912 1477.8945 1479.0073 1482.5176 1486.3962 1490.7361 1491.5486 1494.9413 1513.6328 1575.7885 1609.8485 2855.7825 2868.4116 2909.4079 2983.2638 2984.3316 2985.6385 2990.5538 2995.0408 3027.4747 3033.9518 3045.7903 3060.9933 3075.6831 3079.1044 3083.4924 3085.3714 3089.4660 3090.9335 3119.7789 3122.3461 3141.1611
redmass: 3.5101 3.8118 2.7991 2.0419 2.6955 2.4616 1.1281 2.4849 2.4219 1.1686 2.8919 1.3932 1.3212 1.7933 2.0504 3.2016 3.8619 2.6458 2.2260 3.6058 2.7005 2.9455 3.2422 5.9153 4.5096 3.3425 4.2872 3.0174 4.9516 6.9391 4.2584 4.6220 7.5417 4.8065 8.2241 4.6592 3.6234 10.0250 1.2701 1.2547 3.1311 1.9562 3.1352 3.4651 2.0573 2.3437 2.3917 1.5523 2.5421 3.3055 1.8960 2.1518 1.9250 1.3038 1.6452 1.5028 1.8305 2.5055 2.2970 5.0833 2.2114 3.4355 1.1462 1.1865 4.4091 3.3231 1.5151 1.3105 1.3758 1.6182 1.4051 1.2438 1.3068 1.4466 1.5781 1.7416 1.0887 1.2848 1.5193 1.0539 1.0811 1.4908 1.1511 1.6002 1.2849 1.1201 1.0932 1.0856 1.0868 1.2876 2.1466 8.0566 9.7153 1.0724 1.0713 1.0689 1.0360 1.0397 1.0358 1.0347 1.0337 1.0883 1.0884 1.0880 1.0974 1.0978 1.0975 1.1024 1.0994 1.1003 1.1004 1.1012 1.1043 1.0968
irintensity: 0.5706 0.1804 0.2879 0.2373 0.8449 0.8010 0.5064 10.9874 1.1019 1.2929 3.1929 0.6480 0.1246 1.7449 0.8630 17.2863 1.3101 1.0462 0.9945 0.8538 2.1187 2.7301 4.4203 1.8898 1.4573 0.2202 7.1524 1.4601 0.3758 0.4303 0.1082 2.4906 9.0566 1.0906 3.5343 1.3813 16.0860 6.0170 3.8515 6.5786 6.5002 2.9498 3.7773 69.9963 4.1214 8.3829 16.9238 3.5968 33.7093 51.7033 16.9718 3.1675 18.0920 0.3011 32.8686 12.4312 24.3412 6.6652 30.0694 14.2230 14.1586 23.3734 14.5096 14.9367 50.4249 17.3219 18.1936 6.3531 1.0733 10.2848 34.8006 27.0903 18.4249 33.4720 146.1316 40.3459 6.2732 23.3513 19.9260 5.3216 9.7549 8.7167 2.1629 30.2618 15.9798 36.6654 8.3873 24.4241 36.7357 53.4147 4.4487 66.9626 461.6561 56.5172 136.9846 74.0003 19.5065 15.5929 27.6941 47.5481 51.6553 13.1703 8.7178 6.3009 16.5151 43.5679 72.2167 20.5357 8.9576 32.7624 48.0423 0.5873 4.5846 3.1808
temp: 298.150 k
press: 1.00000 atm
elementType: 8 7 7 7 7 7 6 6 6 6 6 6 6 6 6 6 6 6 6 1 1 1 1 1 1 1 1 1 1 1 1 1 1 1 1 1 1 1 1 1
symmnumber: 1
zpe: 875191.3 jmol-1
zpe.correction: 0.333343 hartree
zpe.thermalcorrener: 0.354000 hartree
zpe.thermalcorrenthalpy: 0.354944 hartree
zpe.thermalcorrgfe: 0.283025 hartree
zpe.sumelectzpe: -855.508590 hartree
zpe.sumelectthermal: -855.487932 hartree
zpe.sumelectthermalent: -855.486988 hartree
zpe.sumelectthermalfe: -855.558907 hartree
dipole: -3.0333 -5.7342 -1.7549
dipole: 6.7202
quadrupole: -99.3202 -125.4057 -113.8488
quadrupole: -22.8009 -2.9535 -6.5178
quadrupole: 13.5380 -12.5475 -0.9906 -22.8009 -2.9535 -6.5178
hfenergy: -855.8419324 hartree
pointgroup: C01 [X(C13H21N5O1)]
dipole: -1.3345448 1.948617 1.1884126 debye
polarizability: 236.6735811|15.2424066|180.3780364|-10.739717|20.653316|134.2580785 unknown
InChI: InChI=1S/C13H21N5O/c1-6-18(7-2)8-10-15-12-11(17(10)5)13(19)14-9(3)16(12)4/h6-8H2,1-5H3
charge 0 multiplicity 1
40 atoms
O  1.999891 -2.511319 -1.326617
N  -3.216643 0.257537 -0.021264
N  -0.297404 -0.907719 0.086452
N  2.518225 1.234952 0.456997
N  0.088465 1.155804 0.990089
N  3.395669 -0.700732 -0.710002
C  -2.28907 0.29002 1.148199
C  -0.84571 0.188699 0.744857
C  1.066242 -0.635955 -0.107429
C  1.259919 0.634496 0.465969
C  -3.066627 1.475836 -0.872239
C  -4.625982 0.02822 0.40752
C  -0.992509 -2.147085 -0.310863
C  2.135626 -1.38072 -0.759502
C  3.552389 0.497592 -0.149735
C  -3.607513 1.281584 -2.300581
C  -4.908041 -1.419472 0.852778
C  2.698473 2.570181 1.063179
C  4.928548 1.124481 -0.155202
H  -2.548324 -0.559439 1.807383
H  -2.392922 1.222346 1.751454
H  -1.987842 1.708139 -0.929793
H  -3.555612 2.361503 -0.393022
H  -5.273379 0.256897 -0.456969
H  -4.919124 0.739162 1.22211
H  -1.143705 -2.800882 0.567378
H  -1.969513 -1.879121 -0.743355
H  -0.356167 -2.676167 -1.036797
H  -3.10753 0.424405 -2.784468
H  -4.696946 1.097862 -2.318244
H  -3.41488 2.187003 -2.905227
H  -4.646321 -2.126639 0.046153
H  -4.341611 -1.703924 1.758252
H  -5.981584 -1.540913 1.087807
H  3.021328 3.30704 0.307138
H  3.445514 2.53621 1.874719
H  1.726651 2.879717 1.477066
H  4.935624 2.100973 -0.674793
H  5.607165 0.437077 -0.678073
H  5.308428 1.290352 0.870568
