program: Gaussian 09
title: 000214324
version: EM64L-G09RevD.01
frameworkgroup: C1[X(C22H29NO2)]
method: RPBEPBE
basis: SDD
operation: Freq
keyword: #p
keyword: freq=noraman
keyword: PBEPBE/SDD
title: #p freq=noraman PBEPBE/SDD
converged: YES YES NO NO
title: Mulliken charges:
elementType: O O N C C C C C C C C C C C C C C C C C C C C C C H H H H H H H H H H H H H H H H H H H H H H H H H H H H H
charge: -0.302718 -0.268296 -0.050476 0.295526 -0.536379 -0.597269 -0.467876 -0.493555 0.462313 -0.380336 -0.367333 -0.514239 -0.474306 -0.279489 -0.696580 0.286526 -0.227090 -0.382899 0.395787 -0.537969 -0.350224 -0.383378 -0.224129 -0.198567 -0.257173 0.218870 0.240402 0.230755 0.264144 0.215252 0.227314 0.202737 0.196524 0.198488 0.231665 0.224846 0.212105 0.236421 0.268060 0.223279 0.200362 0.218469 0.207208 0.206113 0.226223 0.249973 0.244236 0.217920 0.218689 0.249345 0.243888 0.222660 0.226629 0.227552
chargesum: 0.00000
title: Mulliken charges with hydrogens summed into heavy atoms:
elementType: O O N C C C C C C C C C C C C C C C C C C C C C C
charge: -0.302718 -0.268296 -0.050476 0.295526 -0.077108 -0.102370 -0.025310 -0.094294 0.462313 0.049817 0.069618 -0.277818 -0.206245 0.144153 -0.064790 0.286526 -0.000867 -0.132927 0.395787 0.142876 -0.100879 -0.139490 -0.001469 0.028062 -0.029622
polarizability: 3.10784370e+02 4.68223212e+00 2.35935586e+02 9.07460419e+00 1.99551348e+01 1.98241918e+02
1716.lowfreq: -4.0494 -1.7751 -0.0009 -0.0008 -0.0005 5.1799 18.9948 21.1828 29.4170
frequency: 18.8950 21.0357 29.3209 34.7432 50.8657 64.3075 65.7195 86.2791 101.9161 112.7274 120.9052 132.1786 160.7060 181.5977 201.9823 223.1196 232.5897 242.4275 259.9024 262.9971 277.8408 296.0245 303.2500 331.2247 352.4952 401.6045 412.0121 415.3240 430.3928 446.9818 460.3740 467.0198 503.6203 519.9284 546.1645 586.3859 609.6774 612.6400 632.8434 651.9744 690.0045 692.5682 708.4111 738.3275 756.5159 760.6784 764.6589 798.3966 801.7171 822.8762 853.0338 858.4105 867.3121 881.9412 887.9716 894.1358 899.7730 907.7858 944.1694 955.0833 960.3485 971.5778 977.3432 981.3586 982.3849 984.2422 996.6648 1002.5028 1010.1994 1022.6251 1029.2011 1057.1427 1069.7251 1082.7219 1089.0408 1097.7362 1107.1159 1112.7276 1119.4484 1124.3939 1126.6526 1155.1942 1164.7597 1167.5689 1177.8489 1184.2888 1198.1768 1214.5261 1215.0538 1220.9911 1229.8679 1258.1593 1281.3915 1286.5551 1294.7736 1300.9604 1304.6472 1311.2862 1314.6383 1320.5875 1340.3577 1349.3695 1361.8486 1373.7043 1380.9329 1386.5754 1389.9766 1416.3076 1442.1968 1443.2743 1454.9620 1456.4483 1463.0100 1465.5346 1468.1738 1469.0307 1473.9074 1474.6636 1475.6786 1480.0747 1483.6564 1486.1875 1496.4968 1591.2539 1597.9162 1601.9327 1611.6566 2914.8755 2953.7707 2955.6556 2957.8815 2969.2982 2976.3423 2980.4998 2983.3254 3000.1447 3005.4311 3025.9114 3033.3107 3034.7547 3039.2995 3054.5919 3066.6708 3070.5526 3071.7337 3120.0168 3125.8464 3127.7544 3130.8387 3135.9481 3149.6285 3153.6704 3162.3835 3164.6360 3172.0336 3173.1240
redmass: 4.6204 4.3998 4.5930 3.8538 3.2971 4.6176 3.6186 2.0853 3.3267 2.9723 4.1736 3.5614 2.5281 2.7219 1.5778 1.3391 3.8911 4.1416 2.0028 2.8686 2.4293 2.8455 2.6679 3.0236 2.5879 3.4511 2.9115 2.2589 3.4688 4.0432 3.0888 3.0191 2.8657 2.9319 4.1591 4.2848 6.4370 4.9441 2.7524 4.2885 3.2457 2.2684 2.0734 1.1947 1.8658 2.4134 3.6522 1.4681 3.6024 1.2612 1.9690 1.4762 1.7366 1.8889 1.4672 2.9037 1.9644 1.8053 2.4842 2.0827 1.4028 2.4319 1.4588 1.3437 4.8168 4.1193 2.2573 3.0776 2.6087 2.0761 2.6898 2.6370 1.8496 1.5719 2.0878 1.9551 1.9281 1.2616 2.6671 1.8145 2.3886 1.3417 1.6362 1.0798 1.1908 1.3314 1.3848 1.6352 2.8597 1.2020 1.8728 1.5182 1.3703 1.3620 1.1882 1.3757 1.2712 1.2455 1.3298 1.5017 1.3498 1.5076 1.3367 1.5842 6.6430 1.2152 4.2861 2.1277 1.3436 2.2431 1.1451 1.1054 1.0852 1.0571 1.1988 1.0860 1.0644 1.0723 1.0526 1.9548 1.4412 1.1683 1.2524 6.4417 6.2195 6.0212 6.2372 1.0677 1.0335 1.0596 1.0573 1.0359 1.0650 1.0614 1.0720 1.0624 1.0953 1.0908 1.1017 1.1057 1.1037 1.1000 1.1012 1.0992 1.1035 1.0988 1.0918 1.0847 1.0880 1.0888 1.0888 1.0927 1.0955 1.0918 1.1005 1.0971
irintensity: 0.1191 0.4434 0.1011 0.1419 0.0141 0.4616 0.2986 0.1067 6.2203 0.7055 0.9880 2.9844 0.7491 1.4273 1.0905 0.1440 2.3327 2.4896 0.7558 4.2871 1.3270 0.3353 1.3552 0.4612 2.3497 0.9812 0.0579 6.2097 1.8153 0.4771 4.4434 2.4095 11.8252 1.5292 6.7004 6.3887 0.3493 1.5759 8.9762 5.2270 6.6442 34.8931 22.6479 14.7522 55.8642 34.5672 19.3722 37.9734 3.8413 0.0509 9.9160 9.9464 19.9995 8.3420 6.8916 23.0502 5.8379 6.4105 22.8425 12.5978 1.8448 2.3320 0.8166 0.3964 1.6020 6.3657 20.7793 71.8944 17.2888 24.4616 4.5844 3.5119 7.0665 10.9137 5.7516 16.4288 13.5203 0.3942 9.2339 13.7610 3.3790 0.1042 16.2763 8.6191 39.0947 56.3684 3.8516 18.9477 221.5674 24.9584 49.3095 20.2793 5.8974 3.9782 6.3778 17.3004 1.6645 2.8039 1.5615 4.6410 7.1801 0.7447 7.5187 6.3638 3.8505 11.5328 9.9815 34.7033 6.5346 3.5420 39.8034 43.1769 2.6698 14.8810 88.4258 9.3186 0.8859 8.2488 11.1135 73.9520 25.5868 12.9558 4.9880 27.5271 34.1034 113.8688 86.6230 45.4318 50.7004 27.5633 42.8115 52.3347 47.7218 42.3023 37.9990 32.7722 25.9859 30.3159 15.9822 36.5095 49.8570 27.5500 81.8553 48.9850 50.4331 30.8535 6.2767 4.1608 14.2607 9.8382 11.5120 34.4433 25.4087 4.9375 6.5707 6.6036
temp: 298.150 k
press: 1.00000 atm
elementType: 8 8 7 6 6 6 6 6 6 6 6 6 6 6 6 6 6 6 6 6 6 6 6 6 6 1 1 1 1 1 1 1 1 1 1 1 1 1 1 1 1 1 1 1 1 1 1 1 1 1 1 1 1 1
symmnumber: 1
zpe: 1208211.9 jmol-1
zpe.correction: 0.460184 hartree
zpe.thermalcorrener: 0.484785 hartree
zpe.thermalcorrenthalpy: 0.485729 hartree
zpe.thermalcorrgfe: 0.403617 hartree
zpe.sumelectzpe: -1059.012075 hartree
zpe.sumelectthermal: -1058.987475 hartree
zpe.sumelectthermalent: -1058.986530 hartree
zpe.sumelectthermalfe: -1059.068642 hartree
dipole: -0.9445 -1.8942 -1.2593
dipole: 2.4629
quadrupole: -131.0750 -154.7072 -146.9224
quadrupole: 7.5828 -1.3666 6.9826
quadrupole: 13.1599 -10.4723 -2.6876 7.5828 -1.3666 6.9826
hfenergy: -1059.472259 hartree
pointgroup: C01 [X(C22H29N1O2)]
dipole: -0.2381901 -0.04391 0.9382205 debye
polarizability: 306.9345402|5.888854|190.5058982|-17.9130547|6.2473652|247.5214355 unknown
InChI: InChI=1S/C22H29NO2/c1-3-12-22(19-8-7-11-21(17-19)24-2)13-14-23(18-22)15-16-25-20-9-5-4-6-10-20/h4-11,17H,3,12-16,18H2,1-2H3
charge 0 multiplicity 1
54 atoms
O  2.687799 -0.676167 -0.079406
O  -4.808551 -2.099343 -1.153251
N  0.946294 0.012763 2.408079
C  -1.233178 0.49045 1.280838
C  -1.465795 -0.255855 2.658055
C  0.310357 0.847411 1.347499
C  -0.125651 -0.085681 3.438075
C  -2.061202 1.81799 1.240652
C  -1.653843 -0.426653 0.107285
C  1.496015 -1.293143 1.96437
C  -1.830048 2.688479 -0.015734
C  -3.021807 -0.819954 0.029241
C  -0.761666 -0.914424 -0.87805
C  2.871682 -1.164029 1.304137
C  -2.665885 3.986287 0.009342
C  -3.477377 -1.665123 -1.006942
C  -1.227926 -1.762884 -1.914567
C  -2.578302 -2.142462 -1.993363
C  3.835886 -0.483353 -0.866967
C  -5.786665 -1.63096 -0.171582
C  5.16136 -0.707489 -0.417124
C  3.596439 -0.035346 -2.190862
C  6.239656 -0.479418 -1.304363
C  4.681418 0.186901 -3.060903
C  6.01153 -0.033717 -2.624319
H  -2.323621 0.169681 3.210976
H  -1.675618 -1.325653 2.481187
H  0.399294 1.904624 1.665923
H  0.853035 0.744556 0.398969
H  -0.141122 0.861155 4.013784
H  0.077102 -0.908296 4.14578
H  -1.808104 2.408295 2.147068
H  -3.143011 1.586521 1.314617
H  1.639567 -1.910788 2.871817
H  0.82455 -1.863271 1.281499
H  -2.0819 2.098614 -0.918175
H  -0.755429 2.945237 -0.100383
H  -3.72184 -0.464627 0.792269
H  0.30103 -0.660681 -0.848118
H  3.490133 -0.445504 1.876932
H  3.375476 -2.152559 1.267376
H  -2.489294 4.596914 -0.8951
H  -2.414076 4.606619 0.890641
H  -3.748291 3.760231 0.057114
H  -0.520608 -2.132393 -2.665876
H  -2.955001 -2.795608 -2.786134
H  -6.742541 -2.079164 -0.480985
H  -5.530758 -1.971289 0.851378
H  -5.873378 -0.52642 -0.181163
H  5.363736 -1.049238 0.601876
H  2.563425 0.130901 -2.513444
H  7.263739 -0.652375 -0.954133
H  4.489045 0.533478 -4.082486
H  6.852823 0.140363 -3.303149
