program: Gaussian 09
title: 000214255
version: EM64L-G09RevD.01
frameworkgroup: C1[X(C13H17NO3)]
method: RPBEPBE
basis: SDD
operation: Freq
keyword: #p
keyword: freq=noraman
keyword: PBEPBE/SDD
title: #p freq=noraman PBEPBE/SDD
converged: YES YES NO NO
title: Mulliken charges:
elementType: O O O N C C C C C C C C C C C C C H H H H H H H H H H H H H H H H H
charge: -0.245101 -0.215834 -0.419878 -0.131010 -0.134821 -0.345611 -0.345267 -0.323005 -0.312272 -0.740207 0.075558 0.299860 -0.309190 -0.339114 -0.409180 -0.353832 0.291649 0.223492 0.234811 0.206475 0.203081 0.201006 0.216483 0.193761 0.184604 0.214526 0.245486 0.212175 0.231764 0.271796 0.279301 0.222271 0.256995 0.359229
chargesum: 0.00000
title: Mulliken charges with hydrogens summed into heavy atoms:
elementType: O O O N C C C C C C C C C C C C C
charge: -0.245101 -0.215834 -0.060650 -0.131010 0.088672 0.095675 0.058820 0.087238 0.086858 -0.050782 0.075558 0.299860 -0.037394 -0.059812 -0.186909 -0.096837 0.291649
polarizability: 1.98656030e+02 2.38746915e+01 1.60858541e+02 -1.06509077e+01 1.76219755e+01 1.17471266e+02
1716.lowfreq: -13.2223 -4.0039 0.0003 0.0005 0.0007 7.3808 22.6332 28.0037 47.3794
frequency: 22.3084 27.8655 47.3461 84.8326 97.9879 132.8381 158.0365 176.9148 216.2415 246.5690 265.6355 276.4968 295.6594 338.6113 358.6285 383.2026 393.0933 401.0630 410.5145 449.0058 467.4212 500.3481 512.5101 580.3578 597.8392 631.5264 664.7821 717.6978 738.9950 766.8030 798.2705 803.6362 812.0895 844.0370 854.4314 900.9855 914.0354 933.4745 965.7232 992.5097 1003.4567 1016.9939 1025.1802 1044.5313 1055.3497 1080.4435 1090.0247 1101.9124 1105.8548 1132.1912 1142.3857 1155.6857 1179.4947 1190.0439 1224.3864 1245.3535 1256.4437 1273.4167 1292.5746 1306.0339 1311.7390 1326.7011 1337.4468 1356.7861 1369.1558 1371.7168 1386.6098 1395.6383 1430.9997 1441.5188 1450.1574 1453.0429 1455.9021 1466.0475 1472.9597 1500.0222 1557.4395 1595.0327 1620.4960 2885.5498 2902.7619 2946.5240 2959.8942 2967.1942 2995.7168 3016.4349 3043.7401 3077.2329 3084.5963 3086.9106 3105.7725 3116.8027 3152.6300 3173.1442 3176.6564 3575.3186
redmass: 4.9724 3.6359 3.6223 5.0925 6.4072 4.5045 2.8964 1.1492 2.9468 2.3898 2.6457 5.1790 4.0514 5.4137 3.4742 3.5648 1.2473 2.5692 2.3343 4.1431 2.9982 2.8885 3.2557 3.4024 3.8279 6.5892 3.0908 3.3269 3.2078 2.7889 3.2530 2.1011 3.0336 1.6200 1.5650 2.1369 3.7773 1.4188 2.7333 1.3525 2.6929 2.1373 2.1846 1.9785 1.7635 3.6121 2.1483 1.6572 2.1730 2.4758 1.3722 2.9933 1.1458 1.0679 1.5038 1.7930 2.7694 1.2814 1.3874 1.4659 1.5318 1.3528 1.2062 1.3458 1.3108 1.3498 1.2197 4.7698 3.8036 1.0856 1.0787 1.0951 1.0613 1.0872 1.0557 2.7120 8.2332 7.4420 6.4098 1.0683 1.0684 1.0666 1.0662 1.0819 1.0366 1.0913 1.0916 1.0962 1.0979 1.0995 1.0991 1.0903 1.0886 1.0943 1.0961 1.0660
irintensity: 0.9078 1.6792 1.1702 2.8954 0.1845 1.3200 0.3192 0.3066 2.0660 3.8290 2.9835 0.4128 3.3296 5.4128 4.2623 29.4070 116.8512 6.5376 26.0971 2.5582 2.9296 31.0110 10.3253 3.4009 25.5052 0.6384 9.2689 1.9935 9.7801 33.9787 26.7473 3.6091 11.4368 1.7291 36.5011 3.7958 67.3750 0.1306 11.7228 0.1138 1.3342 15.2827 12.9110 18.6964 4.7475 43.2336 22.8002 76.2203 8.7749 38.5203 304.5528 29.2316 38.2435 1.3436 56.8850 72.6062 54.6492 2.7398 2.8674 1.0232 38.2905 26.5473 9.0643 0.3035 6.4889 8.6844 36.5251 0.7333 4.7673 4.0810 1.9591 15.4750 4.8557 11.9514 11.2630 31.5657 220.0681 43.0521 134.4355 74.7432 82.2233 51.8831 73.3995 30.0246 25.8676 47.1078 25.5765 43.7197 39.7103 28.3641 19.9595 16.8600 0.0809 7.1703 4.7807 60.4909
temp: 298.150 k
press: 1.00000 atm
elementType: 8 8 8 7 6 6 6 6 6 6 6 6 6 6 6 6 6 1 1 1 1 1 1 1 1 1 1 1 1 1 1 1 1 1
symmnumber: 1
zpe: 731327.3 jmol-1
zpe.correction: 0.278548 hartree
zpe.thermalcorrener: 0.294759 hartree
zpe.thermalcorrenthalpy: 0.295703 hartree
zpe.thermalcorrgfe: 0.233547 hartree
zpe.sumelectzpe: -784.684853 hartree
zpe.sumelectthermal: -784.668642 hartree
zpe.sumelectthermalent: -784.667698 hartree
zpe.sumelectthermalfe: -784.729854 hartree
dipole: -0.9615 -2.7638 -2.9153
dipole: 4.1306
quadrupole: -107.0749 -103.5745 -96.4227
quadrupole: 11.7943 -1.2993 4.2627
quadrupole: -4.7176 -1.2171 5.9347 11.7943 -1.2993 4.2627
hfenergy: -784.963401 hartree
pointgroup: C01 [X(C13H17N1O3)]
dipole: 0.6640148 -0.876852 1.1963324 debye
polarizability: 190.1208794|-31.3513125|154.5979622|-22.9161905|-16.8817999|132.2669954 unknown
InChI: InChI=1S/C13H17NO3/c1-10(14-6-8-17-9-7-14)13(16)11-2-4-12(15)5-3-11/h2-5,10,15H,6-9H2,1H3
charge 0 multiplicity 1
34 atoms
O  -3.711171 -1.870427 0.470093
O  -0.120328 2.578367 -1.226505
O  4.692738 -1.656817 -0.844693
N  -1.682281 0.184165 0.635883
C  -0.970363 1.487414 0.794353
C  -2.558827 0.076628 -0.559162
C  -2.393829 -0.281185 1.851835
C  -3.001861 -1.386231 -0.728736
C  -2.841326 -1.740745 1.649324
C  -1.878073 2.733641 0.919211
C  0.04669 1.655314 -0.372337
C  1.226485 0.742215 -0.45642
C  1.416434 -0.36292 0.417671
C  2.216198 1.003932 -1.449102
C  2.559302 -1.177144 0.311579
C  3.36037 0.201553 -1.565172
C  3.532322 -0.891843 -0.680232
H  -0.376087 1.3900 1.727377
H  -2.001203 0.40045 -1.456851
H  -3.466128 0.720015 -0.468522
H  -3.294536 0.338755 2.08101
H  -1.70881 -0.220731 2.720309
H  -3.721929 -1.492229 -1.556782
H  -2.111591 -2.023546 -0.918942
H  -1.945778 -2.388968 1.527079
H  -3.444997 -2.095453 2.501449
H  -2.407762 2.937802 -0.025558
H  -2.616892 2.598545 1.729627
H  -1.272757 3.627992 1.148581
H  0.643316 -0.606144 1.150747
H  2.059314 1.856497 -2.117888
H  2.692616 -2.03246 0.98681
H  4.127554 0.397021 -2.319785
H  4.73079 -2.397262 -0.188949
