program: Gaussian 09
title: 000214245
version: EM64L-G09RevD.01
frameworkgroup: C1[X(C14H20FNO)]
method: RPBEPBE
basis: SDD
operation: Freq
keyword: #p
keyword: freq=noraman
keyword: PBEPBE/SDD
title: #p freq=noraman PBEPBE/SDD
converged: YES YES NO NO
title: Mulliken charges:
elementType: F O N C C C C C C C C C C C C C C H H H H H H H H H H H H H H H H H H H H
charge: -0.214747 -0.485661 -0.191213 -0.343155 -0.350489 -0.402851 -0.399497 -0.398317 -0.388855 -0.475251 -0.171587 0.409801 -0.361786 -0.372339 -0.378359 -0.362756 0.312763 0.222311 0.190807 0.187362 0.221824 0.214610 0.200070 0.200529 0.212481 0.191422 0.220906 0.207742 0.243363 0.213178 0.242291 0.185067 0.396112 0.228615 0.295900 0.249583 0.250127
chargesum: 0.00000
title: Mulliken charges with hydrogens summed into heavy atoms:
elementType: F O N C C C C C C C C C C C C C C
charge: -0.214747 -0.089549 -0.191213 0.069963 0.058696 0.011829 0.013513 0.014012 0.062250 -0.019783 0.013480 0.409801 -0.133171 -0.076439 -0.128776 -0.112629 0.312763
polarizability: 2.13630519e+02 3.01666174e-01 1.48597571e+02 1.36403593e-01 1.81388397e+00 1.11176180e+02
1716.lowfreq: -13.9183 -4.5794 -0.0004 -0.0003 0.0004 11.8768 27.9073 34.3625 44.8980
frequency: 27.0680 33.3931 44.6561 75.2490 84.2584 153.0922 159.3050 169.4113 226.8000 241.0856 281.5900 309.3132 328.2023 359.7247 388.7291 409.0567 410.9292 423.1779 444.9917 449.1797 513.3217 532.1881 552.1980 611.4413 628.5230 699.5241 722.5020 745.3452 790.1339 801.4258 814.0521 835.0514 848.0577 851.5973 865.6216 906.0729 921.1311 939.0129 950.9055 955.4484 964.3336 980.0422 1004.8614 1007.3835 1041.7608 1055.6973 1067.6049 1089.4701 1103.4416 1114.8240 1120.2405 1147.1143 1149.8094 1151.4812 1182.1788 1185.2380 1208.6736 1228.8544 1247.5269 1264.3478 1269.3390 1272.0359 1289.7620 1294.5530 1314.2382 1324.1698 1333.5511 1342.3696 1345.5843 1352.0569 1361.0848 1385.9651 1389.7808 1401.2436 1452.3321 1457.8046 1460.0148 1463.5178 1467.4851 1469.7148 1476.5490 1487.7606 1500.6749 1603.5631 1613.0889 2867.1510 2870.0650 2886.6236 2902.6750 2949.2049 2971.1853 2987.2590 2987.8473 2991.3960 3028.7400 3038.3803 3039.2320 3044.6882 3048.2833 3057.2436 3060.4120 3123.2859 3162.2840 3171.7771 3184.4320
redmass: 4.1890 4.5780 4.0757 3.9719 4.8375 3.0369 3.0845 4.6952 2.7478 2.3812 2.8289 1.9377 5.3837 5.4252 3.8916 2.1480 2.9753 4.0820 3.8531 2.9178 3.3171 1.7813 3.8033 3.5132 6.7744 3.0505 2.5947 3.3282 3.9800 1.4798 1.3384 1.5529 2.4349 1.6683 2.3340 2.3665 2.0737 1.3609 1.3124 1.8614 1.3298 1.3589 2.5899 2.5685 2.1736 2.0626 2.9371 1.5786 1.4555 2.7179 2.4299 2.1519 1.2996 1.4298 1.3965 1.6290 3.6281 1.3200 1.5151 1.2108 1.2512 1.2460 1.3879 1.2387 1.2273 1.2709 1.3217 1.3984 1.4564 1.4744 1.3852 2.6344 1.8620 3.1023 1.1193 1.1931 1.0897 1.0913 1.0905 1.0863 1.1110 1.4027 1.8431 7.7656 6.4687 1.0708 1.0699 1.0816 1.0702 1.0684 1.0636 1.0619 1.0611 1.0619 1.0900 1.0932 1.0946 1.0901 1.1026 1.1038 1.0983 1.0897 1.0893 1.0952 1.0960
irintensity: 0.3752 0.1731 0.5602 1.2932 1.3293 2.9421 1.0547 2.2347 0.5301 0.1036 0.7582 8.7056 2.1428 4.1095 2.0647 11.0470 0.0319 0.2226 6.7371 0.1563 12.6765 4.2623 17.5718 3.6889 0.5539 15.0289 18.0176 5.6835 18.2857 0.2135 24.0598 44.0488 16.9398 6.7401 6.3220 10.1263 24.3086 15.0342 36.5063 5.8608 48.5873 3.9540 36.4965 2.5905 7.5247 11.3833 21.8608 14.7626 6.4792 30.3860 5.2119 6.5803 13.3105 42.0456 5.7266 26.2680 15.0798 16.5116 13.0476 5.6095 4.4096 5.0118 8.2879 4.7709 12.2269 4.2453 2.3099 0.3539 5.9632 1.8047 8.6081 3.2231 2.1318 3.6745 35.4216 88.3442 24.3966 13.0537 6.9101 3.1249 7.7744 106.4079 33.9912 8.8307 11.1651 173.5402 213.5431 49.6864 195.2123 588.9506 29.9489 22.9704 27.6440 29.0094 40.1059 17.4802 60.1210 25.7804 15.2742 85.3429 47.3250 16.7439 2.8287 5.5832 3.4105
temp: 298.150 k
press: 1.00000 atm
elementType: 9 8 7 6 6 6 6 6 6 6 6 6 6 6 6 6 6 1 1 1 1 1 1 1 1 1 1 1 1 1 1 1 1 1 1 1 1
symmnumber: 1
zpe: 827325.7 jmol-1
zpe.correction: 0.315112 hartree
zpe.thermalcorrener: 0.330954 hartree
zpe.thermalcorrenthalpy: 0.331898 hartree
zpe.thermalcorrgfe: 0.270532 hartree
zpe.sumelectzpe: -773.986521 hartree
zpe.sumelectthermal: -773.970679 hartree
zpe.sumelectthermalent: -773.969735 hartree
zpe.sumelectthermalfe: -774.031101 hartree
dipole: -5.8323 2.0480 1.5492
dipole: 6.3726
quadrupole: -111.3764 -96.3113 -103.2411
quadrupole: 1.5464 0.1261 -1.4277
quadrupole: -7.7334 7.3316 0.4018 1.5464 0.1261 -1.4277
hfenergy: -774.3016331 hartree
pointgroup: C01 [X(C14H20F1N1O1)]
dipole: 2.2921827 -0.356211 0.9513236 debye
polarizability: 213.5231872|-2.7670269|133.4112512|-1.6937271|-18.4363399|126.4698317 unknown
InChI: InChI=1S/C14H20FNO/c15-13-6-4-12(5-7-13)14(17)8-11-16-9-2-1-3-10-16/h4-7,14,17H,1-3,8-11H2
charge 0 multiplicity 1
37 atoms
F  -5.997466 0.287094 -0.219859
O  0.315753 0.636185 -1.056398
N  2.579667 0.322571 0.335708
C  2.993295 -1.074392 0.660373
C  3.769448 1.198115 0.111557
C  3.849851 -1.677226 -0.471377
C  4.648188 0.659844 -1.034262
C  5.086709 -0.7956 -0.755735
C  1.658885 0.906524 1.363139
C  0.269539 0.219689 1.416675
C  -0.279934 -0.182363 -0.004858
C  -1.798203 -0.067145 -0.079389
C  -2.6191 -0.930847 0.689769
C  -2.405416 0.910809 -0.90336
C  -4.026759 -0.819905 0.652737
C  -3.812261 1.037956 -0.956549
C  -4.588928 0.169046 -0.172941
H  2.085187 -1.683891 0.814644
H  3.572597 -1.090128 1.617835
H  4.378217 1.273129 1.047196
H  3.403425 2.213848 -0.128509
H  3.231116 -1.75593 -1.386462
H  4.155976 -2.702577 -0.189104
H  5.529489 1.317956 -1.155557
H  4.071704 0.700355 -1.978899
H  5.763344 -0.814515 0.123705
H  5.659467 -1.197573 -1.612153
H  2.126189 0.884601 2.375906
H  1.518076 1.966359 1.085449
H  0.29675 -0.680005 2.0614
H  -0.425884 0.932538 1.897138
H  -0.007563 -1.251001 -0.177164
H  1.321772 0.544137 -0.87692
H  -2.162407 -1.701432 1.323016
H  -1.756395 1.551957 -1.505139
H  -4.674374 -1.479594 1.237573
H  -4.29845 1.78511 -1.590988
