program: Gaussian 09
title: 000214228
version: EM64L-G09RevD.01
frameworkgroup: C1[X(C14H17Cl2NO)]
method: RPBEPBE
basis: SDD
operation: Freq
keyword: #p
keyword: freq=noraman
keyword: PBEPBE/SDD
title: #p freq=noraman PBEPBE/SDD
converged: YES YES NO NO
title: Mulliken charges:
elementType: Cl Cl O N C C C C C C C C C C C C C C H H H H H H H H H H H H H H H H H
charge: -0.002086 0.007812 -0.214402 -0.075544 -0.346592 -0.367966 -0.399288 -0.392711 -0.398209 -0.350480 -0.537084 0.120125 0.316168 -0.323734 -0.342797 -0.098178 -0.216338 -0.084957 0.171334 0.199908 0.215818 0.170087 0.192374 0.203350 0.204165 0.193876 0.214868 0.190076 0.194920 0.235055 0.238149 0.255811 0.306167 0.258050 0.262255
chargesum: 0.00000
title: Mulliken charges with hydrogens summed into heavy atoms:
elementType: Cl Cl O N C C C C C C C C C C C C C C
charge: -0.002086 0.007812 -0.214402 -0.075544 0.024650 0.017939 -0.003564 0.005330 0.006735 0.079494 -0.043125 0.120125 0.316168 -0.017566 -0.084747 -0.098178 0.045916 -0.084957
polarizability: 2.74744961e+02 7.23419858e+00 1.77171694e+02 -1.42706957e-01 2.68869208e+00 1.03226693e+02
1716.lowfreq: -12.9935 -1.0611 -0.0015 -0.0014 0.0007 3.7944 13.9985 20.5889 41.1885
frequency: 12.2301 20.2254 41.1633 59.6255 72.1600 101.5261 119.4376 157.2642 163.7066 188.3171 193.0059 225.8512 255.8533 268.6021 301.1071 307.2607 372.5830 396.8492 425.3857 436.4716 441.9331 447.5736 491.3079 503.4291 515.1661 550.5993 601.8541 657.1409 695.1849 707.2399 760.4910 785.0802 800.2179 822.7871 832.3905 854.4215 858.6380 907.8627 933.2907 956.0324 958.4702 982.8955 999.5267 1014.5993 1029.9068 1050.1752 1069.6653 1093.2390 1107.6438 1115.2085 1121.3048 1147.4876 1149.0520 1154.9027 1168.6575 1192.5152 1229.8649 1254.2837 1257.5835 1264.2613 1282.3555 1295.0699 1302.1261 1330.4934 1340.3145 1344.8157 1350.1864 1363.8263 1368.7894 1386.6606 1395.4348 1430.3086 1449.4543 1454.3158 1459.0549 1459.7792 1464.1261 1470.9376 1477.9793 1553.4787 1582.7838 1599.9072 2816.0433 2830.0412 2874.9636 2967.6846 2969.7424 2984.6850 2985.3724 3018.1338 3023.5168 3026.3753 3035.3893 3045.1950 3051.4123 3054.5490 3156.1744 3163.8075 3175.5336
redmass: 3.8191 5.4060 5.3649 4.9351 5.1261 3.0684 3.7430 5.0123 5.5846 5.9536 6.0235 1.8164 4.2136 6.1487 2.0905 12.7962 2.0627 2.9975 8.9292 3.2582 3.3214 2.9204 3.5102 4.7905 5.7580 1.9740 3.0606 6.9919 5.5203 3.5106 4.3722 1.4366 1.5287 1.8631 2.3746 1.6341 2.2039 2.3264 1.4142 1.3063 1.3625 3.3910 4.5006 3.2483 1.9623 2.1405 1.7480 1.8904 2.1156 2.1582 2.5759 1.6289 1.3409 2.3373 1.2658 1.7826 1.7075 1.5247 1.2633 1.1763 1.2147 1.3690 1.9643 1.2809 1.4350 1.5174 1.5070 2.9858 1.7362 3.8440 1.5931 1.1263 1.0919 2.4439 1.0902 1.0972 1.0843 1.0931 1.0970 7.8758 7.2799 8.1855 1.0716 1.0704 1.0709 1.0625 1.0597 1.0616 1.0614 1.0951 1.0864 1.0900 1.0946 1.1033 1.0903 1.1037 1.0882 1.0920 1.0973
irintensity: 0.6007 0.0928 0.1770 1.3893 3.1523 0.5857 0.0959 0.1738 0.0022 2.6800 6.6771 0.6411 0.6929 0.7792 2.5308 1.2508 7.6173 11.8152 2.2580 9.7196 0.0514 0.4960 0.0606 7.6461 28.7590 0.3172 3.1326 12.8995 26.3036 1.2378 14.8753 28.7745 1.7038 25.1658 9.5273 4.3889 9.2379 6.6628 14.1502 4.9216 0.7539 70.3520 28.2679 1.4230 9.1273 10.0076 2.5642 6.3540 39.8779 22.2660 4.4021 13.6933 10.7727 29.9765 7.3514 111.0101 75.3175 12.5834 13.0681 6.8271 7.3605 7.6926 151.7842 9.3815 0.6911 28.0000 1.7744 20.0177 49.9307 35.4088 41.2064 14.5476 7.6139 18.3019 10.5342 4.6902 4.6414 12.8006 10.0231 68.6238 93.4669 20.1825 55.3493 128.0231 99.7176 40.7481 36.2572 31.1413 33.1883 13.3404 75.6475 55.5194 35.6106 21.4359 25.6807 101.0672 3.1170 7.5381 3.2948
temp: 298.150 k
press: 1.00000 atm
elementType: 17 17 8 7 6 6 6 6 6 6 6 6 6 6 6 6 6 6 1 1 1 1 1 1 1 1 1 1 1 1 1 1 1 1 1
symmnumber: 1
zpe: 735364.4 jmol-1
zpe.correction: 0.280086 hartree
zpe.thermalcorrener: 0.297750 hartree
zpe.thermalcorrenthalpy: 0.298694 hartree
zpe.thermalcorrgfe: 0.231034 hartree
zpe.sumelectzpe: -1592.418184 hartree
zpe.sumelectthermal: -1592.400520 hartree
zpe.sumelectthermalent: -1592.399575 hartree
zpe.sumelectthermalfe: -1592.467235 hartree
dipole: -2.9133 2.9671 -0.3201
dipole: 4.1706
quadrupole: -125.7846 -122.4618 -122.4112
quadrupole: 1.6443 1.8846 -1.1585
quadrupole: -2.2321 1.0908 1.1413 1.6443 1.8846 -1.1585
hfenergy: -1592.6982694 hartree
pointgroup: C01 [X(C14H17Cl2N1O1)]
dipole: -1.1380244 1.175535 -0.1239927 debye
polarizability: 274.6910042|6.666495|176.9102208|4.4945098|4.8419086|103.542123 unknown
InChI: InChI=1S/C14H17Cl2NO/c15-12-5-4-11(10-13(12)16)14(18)6-9-17-7-2-1-3-8-17/h4-5,10H,1-3,6-9H2
charge 0 multiplicity 1
35 atoms
Cl 5.725119 -1.557354 0.035169
Cl 6.004185 1.692737 0.429577
O  0.438129 -2.221406 -0.223047
N  -3.278352 -0.162007 0.112948
C  -3.605419 0.870583 -0.906106
C  -4.443543 -1.053742 0.362749
C  -4.807288 1.731529 -0.466868
C  -5.667783 -0.252041 0.846937
C  -6.039812 0.846645 -0.17451
C  -2.063356 -0.942513 -0.226521
C  -0.778669 -0.113052 -0.050203
C  0.48924 -0.963396 -0.09057
C  1.823446 -0.273356 0.042557
C  2.991894 -1.077629 -0.009781
C  1.956213 1.129321 0.218188
C  4.262478 -0.493601 0.107301
C  3.231895 1.715259 0.335524
C  4.386067 0.905262 0.279065
H  -3.836783 0.39221 -1.896327
H  -2.7218 1.517934 -1.056583
H  -4.149962 -1.796915 1.127333
H  -4.722531 -1.621792 -0.564843
H  -5.035562 2.471817 -1.257846
H  -4.529535 2.290979 0.447434
H  -5.425125 0.214644 1.821278
H  -6.518113 -0.942398 1.007331
H  -6.878968 1.461572 0.201994
H  -6.383355 0.371139 -1.116771
H  -2.10193 -1.359931 -1.263722
H  -2.009219 -1.811667 0.452983
H  -0.699165 0.678593 -0.821967
H  -0.834777 0.415214 0.924124
H  2.877184 -2.158139 -0.141821
H  1.073127 1.772634 0.267685
H  3.34427 2.794767 0.470711
