program: Gaussian 09
title: 000214218
version: EM64L-G09RevD.01
frameworkgroup: C1[X(C14H18FNO)]
method: RPBEPBE
basis: SDD
operation: Freq
keyword: #p
keyword: freq=noraman
keyword: PBEPBE/SDD
title: #p freq=noraman PBEPBE/SDD
converged: NO YES NO NO
title: Mulliken charges:
elementType: F O N C C C C C C C C C C C C C C H H H H H H H H H H H H H H H H H H
charge: -0.198759 -0.222265 -0.071990 -0.365249 -0.347226 -0.392947 -0.400161 -0.397987 -0.347046 -0.516105 0.141717 0.109164 0.209384 -0.308963 -0.362629 -0.240975 -0.193260 0.167261 0.213858 0.208655 0.166422 0.190986 0.204158 0.204989 0.190631 0.212706 0.188638 0.232257 0.190759 0.263141 0.246807 0.286853 0.258905 0.238292 0.239979
chargesum: 0.00000
title: Mulliken charges with hydrogens summed into heavy atoms:
elementType: F O N C C C C C C C C C C C C C C
charge: -0.198759 -0.222265 -0.071990 0.015869 0.027850 0.002198 -0.004541 0.003356 0.075970 -0.006157 0.141717 0.109164 0.209384 -0.022110 -0.103724 -0.002683 0.046719
polarizability: 2.21099594e+02 4.87899929e+00 1.59093794e+02 1.34061207e+00 -3.65536171e+00 9.81844250e+01
1716.lowfreq: -0.0007 -0.0005 0.0005 4.2695 7.3063 9.1203 19.3611 33.8663 48.2627
frequency: 19.0731 32.9040 48.2553 63.0779 99.4734 132.5816 150.4608 189.1408 205.6596 232.1287 239.8377 281.7109 298.3955 342.6860 378.2253 416.5858 419.5600 442.7746 452.3346 506.6988 519.9692 532.8093 548.7346 572.2875 629.7278 717.9796 726.1612 771.0328 780.1325 795.6611 804.3784 826.1867 854.9445 859.0509 874.1768 908.6022 958.2453 968.1039 978.2508 1000.6413 1002.2178 1031.2862 1036.6272 1050.3951 1067.4035 1082.4511 1104.3049 1109.4137 1123.2593 1151.5192 1154.0994 1163.1135 1174.7649 1177.8145 1195.4000 1232.9239 1257.6131 1261.8091 1264.5997 1281.9669 1294.9214 1314.0327 1330.7504 1340.8652 1347.3376 1350.1960 1372.7738 1383.1011 1395.9442 1416.9721 1434.7547 1451.2482 1459.4564 1460.2002 1462.2490 1466.8525 1470.3633 1478.9245 1565.2300 1589.2994 1617.2328 2811.9725 2823.3530 2866.8098 2966.2387 2984.3654 2985.3298 2986.2394 3021.0961 3028.6743 3030.8158 3036.0818 3044.8876 3050.8553 3053.9928 3141.8851 3153.8520 3167.3524 3180.3249
redmass: 6.0160 3.7236 4.4949 4.2993 2.8410 4.0328 2.7515 5.2401 3.1561 1.8582 5.2689 4.6893 2.1195 9.5268 1.8079 3.2370 3.2436 3.2767 3.1343 3.3219 7.4939 4.1811 2.1881 2.5138 5.6804 3.0697 4.3667 1.3079 3.6718 1.5818 1.6217 4.4497 1.6013 2.2703 1.4007 2.3781 1.3052 1.3560 3.5798 2.7971 1.3785 1.9504 2.0776 2.1909 2.3578 1.7189 1.9312 2.1890 2.5051 1.2944 2.4101 1.3387 1.2573 1.9928 1.7689 1.8212 1.2620 1.5527 1.1851 1.2037 1.3767 1.7324 1.2982 1.4403 1.5379 1.5057 1.4250 8.7817 1.4793 1.1790 2.2282 1.0903 1.1066 1.1043 2.3076 1.0829 1.0956 1.0991 6.7616 7.7081 7.3767 1.0716 1.0703 1.0709 1.0622 1.0618 1.0612 1.0615 1.0878 1.0921 1.0933 1.0893 1.1034 1.0917 1.1035 1.0862 1.0906 1.0957 1.0995
irintensity: 1.3881 1.9376 0.9024 1.1771 1.7562 0.7471 0.6703 0.9774 7.6627 0.5948 0.0853 5.4554 2.5416 1.6176 3.4670 3.1072 8.6751 0.0791 0.7905 5.8374 16.6479 2.2127 2.4783 0.7052 9.9736 0.9121 2.9825 95.3828 16.1791 0.5569 1.5207 20.3825 2.4046 12.6905 0.2272 7.5405 4.5730 3.4772 58.2777 2.0483 0.4401 8.5736 2.1269 10.7031 11.7809 16.2630 17.6302 27.9047 2.9834 6.8077 26.1281 15.0269 4.7120 20.4535 28.9404 32.4365 4.0537 68.2354 4.7360 7.6236 8.7627 85.7705 13.4088 0.4602 49.7416 6.5314 29.1974 0.3053 16.9468 18.0096 73.6028 7.5226 5.9764 9.2537 30.7627 4.8911 13.5621 11.3040 47.9858 99.5758 47.0325 49.5678 132.1412 110.3219 39.7663 39.2729 33.1720 20.9850 55.0607 38.4728 58.5531 16.6346 19.1733 28.8856 102.3694 3.4959 1.5375 15.7013 12.0188
temp: 298.150 k
press: 1.00000 atm
elementType: 9 8 7 6 6 6 6 6 6 6 6 6 6 6 6 6 6 1 1 1 1 1 1 1 1 1 1 1 1 1 1 1 1 1 1
symmnumber: 1
zpe: 764643.8 jmol-1
zpe.correction: 0.291237 hartree
zpe.thermalcorrener: 0.307100 hartree
zpe.thermalcorrenthalpy: 0.308044 hartree
zpe.thermalcorrgfe: 0.246108 hartree
zpe.sumelectzpe: -772.812115 hartree
zpe.sumelectthermal: -772.796252 hartree
zpe.sumelectthermalent: -772.795308 hartree
zpe.sumelectthermalfe: -772.857245 hartree
dipole: 1.8420 1.6502 0.4429
dipole: 2.5124
quadrupole: -76.9117 -105.1741 -103.2164
quadrupole: 4.2145 -1.5688 1.2057
quadrupole: 18.1891 -10.0734 -8.1157 4.2145 -1.5688 1.2057
hfenergy: -773.1033523 hartree
pointgroup: C01 [X(C14H18F1N1O1)]
dipole: 0.7198583 -0.2365304 0.6347627 debye
polarizability: 220.703954|3.9548551|98.5888317|6.5739322|-5.3953813|159.085027 unknown
InChI: InChI=1S/C14H18FNO/c15-13-7-3-2-6-12(13)14(17)8-11-16-9-4-1-5-10-16/h2-3,6-7H,1,4-5,8-11H2
charge 0 multiplicity 1
35 atoms
F  1.418609 0.364086 2.033698
O  0.979188 0.44835 -2.233917
N  -2.806218 0.37111 -0.287893
C  -3.962965 0.653757 -1.178995
C  -3.085374 -0.791923 0.594164
C  -5.238556 0.94898 -0.365023
C  -4.336379 -0.548896 1.463856
C  -5.565099 -0.226372 0.584176
C  -1.552674 0.216037 -1.06863
C  -0.304416 0.293023 -0.17286
C  0.990108 0.394835 -0.96786
C  2.321753 0.435072 -0.24946
C  2.523268 0.418749 1.152119
C  3.498221 0.495668 -1.051899
C  3.792532 0.456689 1.753836
C  4.783813 0.534346 -0.483021
C  4.933686 0.514564 0.92581
H  -4.162326 -0.211279 -1.867766
H  -3.705663 1.523866 -1.8118
H  -2.211521 -0.963396 1.248177
H  -3.233767 -1.725487 -0.014468
H  -6.080634 1.138779 -1.058449
H  -5.076999 1.870055 0.227918
H  -4.134696 0.301483 2.143544
H  -4.526465 -1.442086 2.089962
H  -6.442431 0.014002 1.214263
H  -5.83279 -1.120363 -0.016837
H  -1.504791 1.034825 -1.808724
H  -1.535644 -0.736863 -1.655916
H  -0.39014 1.170147 0.499902
H  -0.228063 -0.576524 0.508065
H  3.350651 0.510756 -2.136929
H  3.870215 0.442049 2.844696
H  5.666823 0.579851 -1.128184
H  5.930145 0.544709 1.378742
