program: Gaussian 09
title: 000214279
version: EM64L-G09RevD.01
frameworkgroup: C1[X(C20H27N2O3S)]
method: RPBEPBE
basis: SDD
operation: Freq
keyword: #p
keyword: freq=noraman
keyword: PBEPBE/SDD
title: #p freq=noraman PBEPBE/SDD
converged: NO YES NO NO
title: Mulliken charges:
elementType: S O O O N N C C C C C C C C C C C C C C C C C C C C H H H H H H H H H H H H H H H H H H H H H H H H H H H
charge: 0.262875 -0.201776 -0.518219 -0.237981 -0.089476 -0.139095 -0.330488 -0.327512 -0.381144 -0.610620 -0.339106 -0.343714 -0.409673 0.173025 0.040971 -0.630829 0.350115 -0.269090 -0.360177 -0.356208 -0.244804 -0.131598 -0.231413 -0.236518 -0.514427 -0.225567 0.276997 0.259398 0.276812 0.275505 0.332085 0.269563 0.255225 0.260259 0.320593 0.223284 0.273371 0.274793 0.213668 0.305861 0.240177 0.244598 0.302767 0.220552 0.388844 0.262498 0.247299 0.302875 0.264559 0.242515 0.242316 0.278745 0.247286
chargesum: 1.00000
title: Mulliken charges with hydrogens summed into heavy atoms:
elementType: S O O O N N C C C C C C C C C C C C C C C C C C C C
charge: 0.262875 -0.201776 -0.129375 -0.237981 -0.089476 -0.139095 0.205908 0.224805 0.220504 0.225458 0.157548 0.144747 0.136366 0.173025 0.040971 0.137088 0.350115 -0.269090 -0.097679 -0.108909 0.058071 0.132961 0.011102 0.005798 -0.235682 0.021720
polarizability: 2.89672665e+02 6.56921286e+00 2.49750111e+02 6.23093063e+00 1.16686919e+01 1.95587097e+02
1716.lowfreq: -5.2787 -0.0015 -0.0014 -0.0010 6.6613 11.7277 19.6503 31.3465 32.6481
frequency: 19.4747 31.3179 32.5927 43.5045 48.8275 63.8960 68.7040 88.8242 99.3895 103.9344 116.8416 142.6792 158.5584 191.3280 196.3382 204.0644 225.3033 242.7169 246.8016 266.9891 280.0574 285.5042 299.2070 313.5839 325.0786 344.5180 356.1249 377.8743 393.2647 400.2949 415.0189 436.2121 441.4845 473.0034 481.3911 484.6284 498.6613 554.8853 572.8738 595.5812 613.4955 618.2680 621.6900 663.1187 675.2028 691.2969 702.9707 712.3619 714.1219 764.4742 781.0811 792.7464 798.9412 805.8885 827.2852 850.7617 853.1569 861.4348 868.7193 887.5539 926.0909 930.6710 937.8762 953.6691 961.1384 983.0951 990.1055 1003.7840 1007.6895 1007.9985 1021.6346 1026.9595 1041.3397 1043.3285 1048.6005 1056.0519 1079.4941 1088.3793 1091.8213 1107.3112 1118.4181 1134.9274 1152.9828 1160.0041 1170.1531 1180.1323 1185.4096 1194.7690 1203.5520 1211.5851 1225.5775 1246.2035 1268.9115 1277.3812 1286.5266 1302.7005 1320.5800 1322.6698 1330.0029 1337.2376 1346.9129 1365.1464 1373.6332 1375.8937 1381.3646 1383.6135 1410.0938 1420.5396 1436.8824 1439.9080 1442.1304 1450.0082 1457.2483 1459.6821 1466.2380 1473.1274 1475.5761 1477.9508 1479.2354 1484.9831 1492.5763 1495.3500 1545.7262 1570.1633 1592.0582 1607.8132 2973.3763 2976.3781 2980.8789 3011.7692 3023.8130 3026.3260 3027.1742 3032.2566 3063.8804 3085.4500 3095.1303 3100.5216 3104.3139 3109.6757 3117.6316 3121.4969 3131.1660 3139.4647 3140.4678 3151.1172 3155.4622 3161.7087 3173.0824 3175.0995 3188.6214 3235.0330 3539.4695
redmass: 5.8959 3.9499 4.6235 4.5750 3.8946 7.2190 4.9760 5.0308 3.7528 3.4154 1.1421 4.9911 3.5661 3.3894 1.2531 3.8220 5.8683 4.0126 2.2484 3.4569 2.7199 2.6974 2.7661 3.3716 2.7422 3.1641 2.8143 2.2639 4.6110 2.8235 2.2283 2.6014 2.7842 4.6892 3.1221 4.4490 3.6720 4.0589 3.9822 6.0183 4.1069 3.6849 7.4087 5.0084 4.7258 5.4181 1.8644 1.2877 3.7011 2.0311 1.3860 2.8007 2.3113 3.2251 3.9446 3.3929 1.2661 2.8241 1.5157 2.6269 1.6670 1.6092 2.4499 3.9417 3.1178 1.3968 5.8980 2.2481 2.5285 1.3504 2.1059 2.3020 1.8023 1.7513 3.1322 1.8853 1.4121 2.9423 1.5704 1.8402 1.3627 2.0765 2.0635 2.1294 2.3792 1.0526 2.0222 1.1255 1.2782 1.9408 1.3678 1.6281 1.2612 1.3008 1.4480 1.5778 1.3535 1.3397 2.2294 1.2057 1.2099 1.3648 1.2283 1.5056 2.6753 2.1137 1.2631 1.2170 2.1911 1.0877 1.1366 1.0804 1.0828 1.0918 1.0738 2.4212 1.4826 1.1637 2.1482 1.0672 1.0653 1.0490 5.7789 7.4972 6.1257 6.0511 1.0693 1.0690 1.0364 1.0601 1.0602 1.0595 1.0386 1.0578 1.1022 1.1057 1.0960 1.0964 1.1065 1.1078 1.1013 1.0888 1.0976 1.1053 1.0866 1.0913 1.1035 1.0956 1.0914 1.1014 1.0969 1.1008 1.0662
irintensity: 1.1071 0.5012 0.3208 4.1393 2.2037 1.2549 0.5268 5.8465 2.2916 2.9135 0.5738 1.1641 5.1485 0.1069 0.9254 1.8351 0.1341 15.4170 1.9053 3.2963 29.3606 8.3384 16.9617 4.8102 1.6173 5.3482 9.6211 3.6996 14.1542 0.1244 2.8387 1.4541 13.5978 2.7290 0.0628 3.4981 6.8629 7.4656 8.2840 14.7959 0.0823 1.4993 3.4708 11.7008 2.4998 4.3207 39.3981 83.8898 21.3744 67.9940 21.4347 13.1263 5.6100 15.4371 13.3713 10.7717 0.5912 56.2076 9.3510 24.8402 13.0687 13.5788 12.7439 29.3088 37.1310 0.8683 5.6922 6.9780 7.3113 1.0220 7.8172 5.2818 14.1479 17.6448 4.3732 19.1943 15.3335 41.8065 10.8749 28.0685 16.2214 94.1379 2.7165 10.6456 11.6136 0.1420 21.1627 3.4227 4.3270 45.1371 33.9159 3.6548 5.7448 12.8680 84.4561 54.2714 0.8324 4.4066 5.1512 0.8833 11.3365 14.1754 0.3402 17.3723 0.1951 2.4439 5.6149 52.7541 14.5238 14.2358 25.9465 12.1731 26.6344 6.0372 11.5724 8.3815 7.9619 3.9704 12.6433 68.9480 9.8731 24.7027 0.0391 237.3328 1.6543 0.4134 14.8396 51.0165 41.3072 45.8825 12.8745 15.2744 14.3193 11.7641 23.5892 2.8035 3.4344 3.3591 1.9186 8.9087 9.7362 8.0189 0.5789 7.3602 0.0313 7.7447 4.0130 17.0483 1.9655 13.6024 2.1070 0.9279 36.4537
temp: 298.150 k
press: 1.00000 atm
elementType: 16 8 8 8 7 7 6 6 6 6 6 6 6 6 6 6 6 6 6 6 6 6 6 6 6 6 1 1 1 1 1 1 1 1 1 1 1 1 1 1 1 1 1 1 1 1 1 1 1 1 1 1 1
symmnumber: 1
zpe: 1153841.8 jmol-1
zpe.correction: 0.439475 hartree
zpe.thermalcorrener: 0.465313 hartree
zpe.thermalcorrenthalpy: 0.466257 hartree
zpe.thermalcorrgfe: 0.382710 hartree
zpe.sumelectzpe: -1509.312970 hartree
zpe.sumelectthermal: -1509.287133 hartree
zpe.sumelectthermalent: -1509.286188 hartree
zpe.sumelectthermalfe: -1509.369736 hartree
dipole: 9.9255 -1.4457 -2.9714
dipole: 10.4611
quadrupole: -106.2111 -129.6527 -147.4827
quadrupole: -9.3593 2.3153 7.4139
quadrupole: 21.5711 -1.8705 -19.7005 -9.3593 2.3153 7.4139
hfenergy: -1509.7524455 hartree
pointgroup: C01 [X(C20H27N2O3S1)]
dipole: 3.9894739 -0.7038352 0.7265538 debye
polarizability: 266.0258287|-33.1906159|228.1089219|0.3884196|-31.2103833|240.8751219 unknown
InChI: InChI=1S/C20H27N2O3S/c1-21(10-11-22(2)12-14-25-15-13-22)19(23)20(24,18-9-6-16-26-18)17-7-4-3-5-8-17/h3-9,16,24H,10-15H2,1-2H3
charge 1 multiplicity 1
53 atoms
S  -0.673104 0.246928 2.319953
O  5.322719 -2.42971 1.779211
O  0.218437 1.751921 -0.040695
O  -1.82083 -0.149541 -2.444017
N  3.114808 -0.885372 0.546894
N  0.485502 -0.243008 -2.227113
C  4.399741 -1.293618 -0.206171
C  2.914811 -1.857382 1.742051
C  1.880633 -1.052487 -0.373141
C  3.191497 0.556966 1.053298
C  5.600685 -1.430499 0.742722
C  4.182626 -2.00275 2.597077
C  1.769036 -0.026709 -1.527594
C  -0.780497 0.174559 -1.799658
C  -0.998975 0.97745 -0.458113
C  0.558135 -1.055319 -3.468082
C  -2.137484 1.997545 -0.652834
C  -1.271096 -0.051549 0.628857
C  -3.228549 2.085773 0.241587
C  -2.03188 2.93279 -1.718269
C  -2.028313 -1.211478 0.568919
C  -2.14238 -1.901054 1.833606
C  -4.198712 3.100484 0.079695
C  -3.000049 3.945472 -1.876888
C  -1.476088 -1.269859 2.869441
C  -4.08636 4.033625 -0.974592
H  4.187188 -2.270671 -0.672805
H  4.585384 -0.543298 -0.992659
H  2.0596 -1.475979 2.327263
H  2.648582 -2.832578 1.300471
H  0.999191 -0.951107 0.283009
H  1.914883 -2.085423 -0.762779
H  3.837206 0.604473 1.940418
H  3.611409 1.196645 0.263286
H  2.172695 0.895476 1.297787
H  5.884458 -0.459198 1.199012
H  6.464845 -1.812696 0.177046
H  4.022805 -2.804625 3.335196
H  4.429265 -1.072217 3.149548
H  1.797395 0.997688 -1.1346
H  2.575656 -0.164441 -2.269189
H  1.155587 -0.530007 -4.235046
H  -0.462913 -1.205105 -3.847098
H  1.014342 -2.04285 -3.266501
H  -0.043914 2.708842 -0.029532
H  -3.333465 1.360805 1.05456
H  -1.213351 2.852589 -2.444428
H  -2.511256 -1.542164 -0.354431
H  -2.70978 -2.825338 1.965867
H  -5.043606 3.158308 0.7738
H  -2.917293 4.654155 -2.707466
H  -1.410537 -1.551028 3.91954
H  -4.84269 4.815469 -1.100014
