program: Gaussian 09
title: 000214165
version: EM64L-G09RevD.01
frameworkgroup: C1[X(C10H21Cl2NO)]
method: RPBEPBE
basis: SDD
operation: Freq
keyword: #p
keyword: freq=noraman
keyword: PBEPBE/SDD
title: #p freq=noraman PBEPBE/SDD
converged: YES YES NO NO
title: Mulliken charges:
elementType: Cl Cl O N C C C C C C C C C C H H H H H H H H H H H H H H H H H H H H H
charge: -0.077541 -0.077081 -0.273431 -0.111366 -0.416179 -0.338565 -0.335772 -0.225609 -0.370978 -0.244290 -0.347124 -0.566982 -0.563526 -0.684905 0.230504 0.228755 0.233940 0.236889 0.235324 0.232687 0.189006 0.186480 0.206127 0.207167 0.181814 0.182879 0.193022 0.192194 0.263144 0.264754 0.265950 0.261873 0.212001 0.216854 0.211983
chargesum: 0.00000
title: Mulliken charges with hydrogens summed into heavy atoms:
elementType: Cl Cl O N C C C C C C C C C C
charge: -0.077541 -0.077081 -0.273431 -0.111366 0.043080 0.132265 0.132238 0.149878 0.042317 0.120403 0.038092 -0.039084 -0.035703 -0.044067
polarizability: 1.66948952e+02 -3.45428512e+00 1.58157871e+02 -9.93607605e-01 -1.52158476e-01 1.08332143e+02
1716.lowfreq: -15.4213 -7.0318 -4.5506 -0.0012 -0.0003 0.0002 7.1780 12.5884 19.1272
frequency: -4.4451 10.6537 19.0105 26.4575 45.4346 58.2505 82.7600 86.1075 90.8571 106.9154 122.0224 134.6907 180.1086 194.1005 198.8743 234.6198 246.1857 278.7867 311.1311 365.4609 401.4087 448.8293 483.3798 513.9280 653.3689 656.6951 740.1130 766.5909 773.7834 797.3258 807.2718 832.6129 891.0589 932.4428 934.7322 997.9235 998.4160 1022.2715 1039.7330 1055.8064 1059.7168 1071.8838 1078.5291 1085.4294 1108.8524 1125.0641 1127.2225 1145.5540 1173.1584 1210.0513 1235.0471 1241.0526 1252.1271 1256.1877 1267.9059 1270.4227 1278.9852 1281.5971 1305.2274 1322.5361 1328.7917 1346.3716 1359.7145 1363.9415 1371.3133 1388.9252 1403.5361 1446.6124 1449.6206 1462.9091 1467.0652 1469.0901 1470.4312 1473.6250 1477.6094 1479.5549 1486.4336 1492.6096 2903.6989 2914.4656 2943.6030 2953.7171 2956.8020 2961.1265 2963.8369 2966.5876 2975.3203 2991.9229 3009.8942 3039.8924 3048.3647 3051.8621 3054.8951 3055.1116 3056.5252 3073.9088 3075.4225 3143.1650 3144.7980
redmass: 2.4356 3.4418 5.0256 6.2948 3.4788 2.9007 2.3697 2.4989 2.2106 3.2230 2.1420 3.0258 4.1609 4.3763 5.5405 1.1074 3.9892 3.6679 4.0476 3.8594 3.3657 3.0738 2.9806 3.5603 6.1534 6.1155 1.0727 1.1189 1.1401 1.1397 1.1370 4.7745 2.2295 3.2060 1.1717 1.5964 1.4389 4.2963 2.9981 3.2862 4.3351 3.5785 2.2026 2.1869 1.6605 1.3233 2.6589 1.3672 1.2930 1.3757 1.2708 1.2341 1.4499 1.4829 1.2757 1.1754 1.1182 1.0808 1.2480 1.4209 1.3956 1.5217 1.3667 1.3923 1.3424 1.2161 1.4598 1.0891 1.0886 1.0772 1.0830 1.0877 1.0758 1.0727 1.0425 1.0741 1.0762 1.0875 1.0548 1.0550 1.0714 1.0662 1.1055 1.0740 1.0879 1.0588 1.0363 1.0592 1.1005 1.0979 1.0955 1.0936 1.0600 1.1026 1.0602 1.1012 1.0995 1.1124 1.1125
irintensity: 0.4480 0.3702 0.4650 0.8274 0.6801 0.1319 1.8153 2.1613 0.8277 2.4549 1.2588 3.1886 4.4632 8.2138 2.0088 0.0622 3.0943 0.5855 3.7852 18.6316 2.0840 5.3593 4.4675 6.0252 97.5870 105.6232 8.9401 3.8127 10.5415 2.4149 0.0863 13.0096 9.2544 6.7253 0.7475 4.0854 3.6071 39.2172 5.0056 9.9121 75.8126 121.8951 26.8743 3.6019 49.3825 21.4629 3.8169 3.3573 3.1186 0.1135 20.6493 19.6935 8.8425 17.2592 0.3118 0.0736 0.5098 0.1326 23.2784 20.8419 15.1633 3.5949 8.1294 11.1705 3.4009 10.5117 3.5021 4.4639 5.6784 7.2947 10.8998 11.8678 5.2983 4.3392 12.3936 10.8930 3.1980 12.2801 38.5238 92.3723 36.1169 43.8064 52.8325 15.6627 96.5219 37.3715 32.7530 43.0679 6.5342 4.5450 17.6440 35.3223 12.5628 30.4877 33.5630 98.0260 51.5647 13.2509 28.5867
temp: 298.150 k
press: 1.00000 atm
elementType: 17 17 8 7 6 6 6 6 6 6 6 6 6 6 1 1 1 1 1 1 1 1 1 1 1 1 1 1 1 1 1 1 1 1 1
symmnumber: 1
zpe: 786303.9 jmol-1
zpe.correction: 0.299487 hartree
zpe.thermalcorrener: 0.317568 hartree
zpe.thermalcorrenthalpy: 0.318512 hartree
zpe.thermalcorrgfe: 0.247604 hartree
zpe.sumelectzpe: -1442.552049 hartree
zpe.sumelectthermal: -1442.533968 hartree
zpe.sumelectthermalent: -1442.533024 hartree
zpe.sumelectthermalfe: -1442.603933 hartree
dipole: -2.7983 0.1270 -0.4896
dipole: 2.8436
quadrupole: -108.2794 -120.9157 -100.6313
quadrupole: 0.0153 5.8999 0.4759
quadrupole: 1.6627 -10.9736 9.3108 0.0153 5.8999 0.4759
hfenergy: -1442.8515367 hartree
pointgroup: C01 [X(C10H21Cl2N1O1)]
dipole: -1.104601 0.0758818 -0.160489 debye
polarizability: 166.736357|-3.4885546|158.1836343|-2.6859597|2.1669531|108.5189745 unknown
InChI: InChI=1S/C10H21Cl2NO/c1-2-3-9-14-10-8-13(6-4-11)7-5-12/h2-10H2,1H3
charge 0 multiplicity 1
35 atoms
Cl 3.459334 3.726899 -0.349517
Cl 4.099168 -3.37873 -0.773602
O  -1.757407 -0.223174 0.43468
N  1.98025 -0.056141 0.539134
C  0.593563 -0.350963 0.942159
C  2.477986 1.313524 0.732222
C  2.950469 -1.160524 0.534798
C  -0.43826 0.095006 -0.109898
C  -4.175935 -0.171166 0.240335
C  -2.856971 0.160414 -0.463471
C  -5.411846 0.17958 -0.620372
C  2.821486 1.957885 -0.622415
C  2.875444 -1.926709 -0.797158
C  -6.740183 -0.133595 0.101918
H  0.484126 -1.440588 1.092777
H  0.337304 0.134448 1.908715
H  3.376099 1.336274 1.383885
H  1.700886 1.921064 1.232545
H  2.775612 -1.868797 1.372288
H  3.971567 -0.755832 0.66011
H  -0.261554 -0.438751 -1.070875
H  -0.353603 1.18928 -0.303671
H  -4.214766 0.380277 1.19963
H  -4.184002 -1.249529 0.491331
H  -2.794396 1.249235 -0.691361
H  -2.770262 -0.395897 -1.424678
H  -5.369443 -0.382171 -1.575856
H  -5.383256 1.255592 -0.888599
H  3.636131 1.432856 -1.144155
H  1.938978 2.050991 -1.272514
H  1.886717 -2.380571 -0.963621
H  3.163982 -1.298968 -1.65323
H  -6.823463 0.441831 1.042835
H  -7.611974 0.119575 -0.52862
H  -6.807782 -1.207427 0.358552
