program: Gaussian 09
title: 000214175
version: EM64L-G09RevD.01
frameworkgroup: C1[X(C15H12ClNO4)]
method: RPBEPBE
basis: SDD
operation: Freq
keyword: #p
keyword: freq=noraman
keyword: PBEPBE/SDD
title: #p freq=noraman PBEPBE/SDD
converged: YES YES NO NO
title: Mulliken charges:
elementType: Cl O O O O N C C C C C C C C C C C C C C C H H H H H H H H H H H H
charge: -0.033231 -0.444593 -0.223196 -0.435149 -0.311256 -0.479853 0.401873 0.148001 0.370824 0.499054 -0.345528 -0.550970 -0.361228 0.065297 -0.330970 -0.805379 -0.307219 -0.222568 0.096944 -0.256166 0.140488 0.374935 0.286843 0.261634 0.255842 0.234163 0.232078 0.235036 0.273057 0.228493 0.232228 0.384814 0.385701
chargesum: 0.00000
title: Mulliken charges with hydrogens summed into heavy atoms:
elementType: Cl O O O O N C C C C C C C C C C C C C C C
charge: -0.033231 -0.059780 -0.223196 -0.049448 -0.311256 -0.104918 0.401873 0.148001 0.370824 0.499054 -0.345528 -0.264127 -0.099594 0.065297 -0.075128 -0.104101 -0.034162 0.005925 0.096944 -0.023938 0.140488
polarizability: 3.11731317e+02 -2.56401161e+00 2.09165582e+02 -3.77824720e+00 -1.53648603e+01 1.21445580e+02
1716.lowfreq: -5.3411 -3.7286 -1.2255 -0.0021 -0.0021 0.0014 27.0647 31.0823 41.9430
frequency: 27.0371 31.0802 41.9271 51.3194 56.5239 91.6700 102.1313 136.0215 142.5151 168.5106 186.8532 195.4555 205.9459 230.3451 280.3901 299.4013 333.4872 357.9703 392.1366 397.1207 413.9502 421.0853 467.8730 483.5265 513.4143 524.2420 544.4259 571.9852 575.9588 587.6752 601.9718 618.3513 632.7902 682.1066 691.5593 717.6305 737.4810 755.3550 762.4598 780.5818 794.3635 812.0513 873.0700 876.1263 880.0197 929.2283 933.3529 970.8840 991.5015 1003.0615 1009.9292 1012.3924 1043.6254 1051.0255 1108.7856 1124.2618 1166.0445 1178.3369 1204.7915 1230.9338 1235.7933 1277.6275 1306.2243 1322.3813 1337.1001 1367.4413 1396.3181 1399.8938 1401.8446 1443.4043 1452.0538 1470.1956 1473.0852 1478.0709 1515.1267 1548.8326 1586.0307 1607.7330 1611.6002 1640.2275 1642.9940 2980.2565 3058.2582 3091.8518 3132.0955 3151.2132 3153.8275 3164.0219 3173.9698 3181.1079 3233.5515 3527.3692 3531.7640
redmass: 7.7257 7.5522 5.6410 5.3345 1.1302 7.7326 9.5732 6.7109 5.3503 4.9348 4.8473 5.5734 6.6244 4.0680 6.5356 5.3400 7.6236 6.0640 8.4254 7.0458 5.6697 3.3008 3.9413 6.5095 3.3561 4.7953 5.1798 3.0927 1.2477 1.5881 3.1278 3.8607 5.5038 4.1782 5.4683 1.6447 5.2437 5.7765 1.6896 2.4703 3.5895 6.2699 1.4626 4.5309 1.4305 3.9699 1.6162 1.3648 1.3282 2.0349 2.5872 3.6202 2.1905 1.5323 2.0163 1.7032 1.6081 1.1032 1.6284 1.8801 2.8767 1.9932 2.4288 2.1758 2.8613 4.8620 6.6872 3.7718 1.2637 2.7954 2.3473 1.0472 1.9782 1.6445 3.1141 6.0288 6.9793 3.1117 6.5460 4.5441 6.0999 1.0376 1.0977 1.0987 1.0865 1.0927 1.0898 1.0954 1.0919 1.0983 1.0792 1.0641 1.0641
irintensity: 0.4864 1.0625 1.2637 0.9683 0.3810 0.8559 0.4097 0.0924 0.4615 2.7214 0.3710 0.3048 4.7376 1.4102 2.4669 2.5286 0.4125 3.6080 5.0935 16.6647 4.0641 15.1120 2.3184 17.0746 10.8919 17.4729 3.5130 15.4645 102.1667 123.4748 85.1401 27.9860 6.7349 36.3639 13.9560 45.3950 8.7484 5.5384 122.1925 5.1953 109.8030 29.1485 1.3858 3.5875 22.0081 3.1036 1.1803 2.4213 0.0508 139.5954 285.6209 93.4473 17.5390 11.7655 88.1859 266.8340 138.6881 1.9951 5.7473 11.2011 22.2114 8.9650 110.6650 58.9007 206.6185 12.1969 4.1938 1.9827 3.9837 32.9017 204.8175 13.5442 12.5729 46.9140 410.4866 18.0576 167.9845 135.6354 45.2968 201.0175 257.8971 42.4797 17.4093 15.0141 6.4590 2.7782 13.1827 10.0201 3.1879 11.9410 259.6283 46.7296 67.6532
temp: 298.150 k
press: 1.00000 atm
elementType: 17 8 8 8 8 7 6 6 6 6 6 6 6 6 6 6 6 6 6 6 6 1 1 1 1 1 1 1 1 1 1 1 1
symmnumber: 1
zpe: 627437.2 jmol-1
zpe.correction: 0.238978 hartree
zpe.thermalcorrener: 0.258229 hartree
zpe.thermalcorrenthalpy: 0.259173 hartree
zpe.thermalcorrgfe: 0.189528 hartree
zpe.sumelectzpe: -1393.055008 hartree
zpe.sumelectthermal: -1393.035757 hartree
zpe.sumelectthermalent: -1393.034813 hartree
zpe.sumelectthermalfe: -1393.104458 hartree
dipole: -2.1647 -1.7735 1.0600
dipole: 2.9925
quadrupole: -104.1717 -120.2939 -128.6123
quadrupole: 2.3672 -0.3926 -3.0413
quadrupole: 13.5210 -2.6012 -10.9197 2.3672 -0.3926 -3.0413
hfenergy: -1393.2939858 hartree
pointgroup: C01 [X(C15H12Cl1N1O4)]
dipole: 0.8566194 0.1740223 0.7886958 debye
polarizability: 310.5304347|-14.4264406|154.1780611|4.9480569|44.5559853|177.6339833 unknown
InChI: InChI=1S/C15H12ClNO4/c1-8-6-10(15(20)21)13(11(16)7-8)17-12-5-3-2-4-9(12)14(18)19/h2-7,17-18,20H,1H3
charge 0 multiplicity 1
33 atoms
Cl 1.048787 -2.90173 -1.772076
O  1.86163 2.726502 1.398262
O  -0.004272 2.340173 0.083323
O  -4.38908 -0.193361 -1.904562
O  -2.222801 -0.749743 -2.483992
N  -0.334968 -0.501913 -0.619379
C  1.054391 -0.450508 -0.409909
C  1.759643 0.627964 0.228328
C  -1.355988 -0.222471 0.291485
C  3.925969 -0.556575 -0.011184
C  1.86084 -1.523453 -0.894657
C  3.16296 0.536764 0.443679
C  3.248264 -1.586105 -0.717083
C  -2.723351 -0.162223 -0.165273
C  -1.104252 -0.051708 1.684439
C  5.423106 -0.637804 0.220861
C  -3.768305 0.098708 0.766118
C  -2.153789 0.19356 2.581307
C  1.088012 1.921755 0.531995
C  -3.497554 0.281869 2.129394
C  -3.04226 -0.390592 -1.58001
H  -0.677229 -0.823804 -1.546391
H  3.653226 1.369862 0.953915
H  3.801531 -2.446972 -1.107081
H  -0.079825 -0.133681 2.059519
H  5.974968 -0.729332 -0.733021
H  5.796634 0.259468 0.741924
H  5.687063 -1.518617 0.835963
H  -4.792676 0.146045 0.386805
H  -1.927352 0.311925 3.647111
H  -4.309492 0.480199 2.835488
H  1.384036 3.591192 1.51643
H  -4.505466 -0.381093 -2.874231
