program: Gaussian 09
title: 000012368
version: EM64L-G09RevD.01
frameworkgroup: C1[X(C6H12Br2)]
method: RPBEPBE
basis: SDD
operation: Freq
keyword: #pfreq=noraman
keyword: PBEPBE/SDD
title: #p freq=noraman PBEPBE/SDD
converged: YES YES NO NO
title: Mulliken charges:
elementType: Br Br C C C C C C H H H H H H H H H H H H
charge: -0.041176 -0.041181 -0.367413 -0.367413 -0.312415 -0.312405 -0.693845 -0.693847 0.201169 0.201571 0.201303 0.201433 0.227350 0.227005 0.227090 0.227263 0.278810 0.278943 0.278848 0.278909
chargesum: 0.00000
title: Mulliken charges with hydrogens summed into heavy atoms:
elementType: Br Br C C C C C C
charge: -0.041176 -0.041181 0.035327 0.035322 0.141941 0.141949 -0.136092 -0.136090
polarizability: 1.56853473e+02 -1.60747387e+01 7.34275244e+01 2.68071161e-02 -1.29315775e-02 6.03359140e+01
1716.lowfreq: -0.0003 0.0000 0.0002 1.2352 4.7565 11.4687 26.4707 48.3614 68.4570
frequency: 26.4706 48.3596 68.4568 90.3014 108.8649 126.1236 147.3518 186.9159 245.7646 367.2003 426.1210 604.2834 635.5046 733.3673 746.4347 769.6770 840.5678 940.2321 993.3574 1009.3014 1033.1991 1059.7369 1064.9867 1066.2976 1082.0369 1202.9005 1204.4256 1228.6808 1253.0989 1267.1249 1278.5407 1293.1758 1295.4016 1311.6717 1341.0550 1349.9534 1451.3254 1452.0559 1465.5507 1466.8297 1475.5442 1486.3728 2961.1697 2967.9528 2994.9826 2996.3780 3002.0923 3025.7277 3046.7038 3046.7303 3054.8008 3061.7947 3131.0934 3131.2755
redmass: 5.9091 6.2700 1.9147 2.8489 16.7037 1.9374 2.2260 5.0525 5.1523 4.0630 3.5401 5.4832 4.6588 1.0654 1.0867 1.1520 1.2497 1.2567 5.2214 4.7462 1.1635 2.9094 3.1552 1.0211 3.4627 1.1507 1.5854 1.1883 1.3153 1.2289 1.1123 1.0923 1.0960 1.3121 1.4017 1.5255 1.1016 1.1034 1.0818 1.0636 1.0962 1.1008 1.0587 1.0589 1.0598 1.0591 1.0995 1.1037 1.0564 1.0564 1.1044 1.1044 1.1112 1.1111
irintensity: 2.7646 2.2443 1.0994 0.0000 0.0001 0.0000 0.2340 0.0001 10.9296 4.4190 0.0000 0.0000 76.1735 15.3824 0.0001 8.4998 0.0001 2.6689 1.9574 0.0000 0.0002 0.0008 16.7278 2.5636 0.0000 12.7611 0.0038 0.0001 2.3063 96.9003 0.0009 0.0009 0.8462 0.0000 18.4145 0.0000 0.0014 6.1069 0.9822 0.0000 0.0000 22.4231 0.0008 42.2226 0.0044 49.7323 0.0292 15.8202 2.0827 45.5868 0.0031 81.7180 0.0024 36.2833
temp: 298.150 k
press: 1.00000 atm
elementType: 35 35 6 6 6 6 6 6 1 1 1 1 1 1 1 1 1 1 1 1
symmnumber: 1
zpe: 440616.5 jmol-1
zpe.correction: 0.167822 hartree
zpe.thermalcorrener: 0.178768 hartree
zpe.thermalcorrenthalpy: 0.179713 hartree
zpe.thermalcorrgfe: 0.126919 hartree
zpe.sumelectzpe: -262.093174 hartree
zpe.sumelectthermal: -262.082227 hartree
zpe.sumelectthermalent: -262.081283 hartree
zpe.sumelectthermalfe: -262.134077 hartree
dipole: 0.0002 0.0004 0.0071
dipole: 0.0071
quadrupole: -103.7738 -67.5788 -68.7476
quadrupole: 4.4452 -0.0030 -0.0053
quadrupole: -23.7404 12.4546 11.2859 4.4452 -0.0030 -0.0053
hfenergy: -262.2609956 hartree
pointgroup: C01 [X(C6H12Br2)]
dipole: 0.0000885 -0.0001788 -0.0027843 debye
dipolederiv: -0.6781353 -0.0639158 0.0008583 -0.1930431 -0.2045376 0.0005238 0.0023959 0.000451 -0.154317 -0.6780044 -0.0640311 0.0006212 -0.1930319 -0.2046403 0.0003432 0.0007898 0.0002246 -0.1543654 -0.0866457 -0.0014397 0.0001525 0.1248543 0.1034749 0.0000916 -0.0001658 -0.0004305 0.1929344 -0.086663 -0.0014455 0.000033 0.1248851 0.1035222 0.0000278 -0.000438 0.0000904 0.1929195 -0.2631912 0.0072406 0.0002307 -0.1272247 0.0109528 0.0013575 0.0004439 0.0013046 0.1364136 -0.2629741 0.007194 0.0002176 -0.1273408 0.0109283 0.0003838 0.0011099 0.0005914 0.1363176 0.8686146 0.2279537 -0.0022715 0.2359692 0.2239397 -0.0010503 -0.0031112 -0.0009942 0.1301382 0.8682741 0.2281248 -0.0011713 0.2359944 0.2240868 -0.0005283 -0.0009644 -0.0005068 0.1303103 0.0537407 -0.0030694 0.0067324 -0.0053544 -0.0329084 0.1107702 0.0047621 0.132828 -0.0773073 0.0525703 -0.003145 -0.006731 -0.0055352 -0.033144 -0.1108027 -0.0048877 -0.1327965 -0.0769114 0.0532427 -0.0034977 -0.0069476 -0.0058528 -0.0336256 -0.1108498 -0.0052096 -0.1329085 -0.0765972 0.053054 -0.0027065 0.0065186 -0.0050848 -0.0324316 0.1107113 0.0044771 0.1327277 -0.0776185 0.0680385 -0.0007927 -0.0065204 0.017441 -0.0116486 0.0993959 0.0029876 0.1097284 -0.0569628 0.067787 -0.0000772 0.0066734 0.0177749 -0.0136918 -0.1001147 -0.002554 -0.110397 -0.0555541 0.0677509 -0.0003558 -0.0066858 0.0177032 -0.0117862 0.0995261 0.0024566 0.1099435 -0.057211 0.0680799 -0.0005176 0.00652 0.0175645 -0.0135461 -0.0999201 -0.0030215 -0.110187 -0.0552603 -0.0413935 -0.0820488 -0.0330534 -0.0325635 -0.0229324 -0.0885013 0.0168943 -0.1007928 -0.0175892 -0.0413795 -0.0807167 0.0342824 -0.0323121 -0.0195154 0.08841 -0.0161069 0.1010704 -0.0208262 -0.0414195 -0.0813466 0.0339273 -0.0324844 -0.020715 0.0886747 -0.016419 0.1009656 -0.0197901 -0.0413465 -0.0814069 -0.0333866 -0.032359 -0.0217817 -0.0884489 0.016561 -0.1009123 -0.0187231 unknown
polarizability: 155.1326034|19.9741448|75.147703|-0.1895561|-0.0987787|60.3366052 unknown
InChI: InChI=1S/C6H12Br2/c7-5-3-1-2-4-6-8/h1-6H2
charge 0 multiplicity 1
20 atoms
Br -4.910173 -0.3560 -0.021857
Br 4.910203 0.356006 -0.032688
C  -0.611207 0.474163 -0.026696
C  0.61137 -0.474607 -0.026776
C  -1.952785 -0.30366 -0.02627
C  1.952914 0.303189 -0.031486
C  -3.144363 0.656325 -0.033073
C  3.144567 -0.656725 -0.028963
H  -0.561348 1.135243 -0.916284
H  -0.561434 1.135394 0.86271
H  0.559855 -1.137677 -0.914775
H  0.563251 -1.13384 0.864223
H  -2.006958 -0.956153 0.865829
H  -2.003232 -0.963665 -0.913155
H  2.004176 0.955312 -0.924139
H  2.006238 0.96355 0.854858
H  -3.1837 1.292925 0.865032
H  -3.186816 1.276434 -0.942472
H  3.185622 -1.282755 0.876472
H  3.18552 -1.287458 -0.931089
