program: Gaussian 09
title: 000214142
version: EM64L-G09RevD.01
frameworkgroup: C1[X(C19H12ClN3O5S2)]
method: RPBEPBE
basis: SDD
operation: Freq
keyword: #p
keyword: freq=noraman
keyword: PBEPBE/SDD
title: #p freq=noraman PBEPBE/SDD
converged: YES YES NO NO
title: Mulliken charges:
elementType: Cl S S O O O O O N N N C C C C C C C C C C C C C C C C C C C H H H H H H H H H H H H
charge: -0.025689 0.914527 0.274361 -0.317772 -0.524833 -0.487392 -0.228075 -0.220235 -0.474051 -0.443126 -0.020681 -0.069806 0.530646 -0.260108 -0.157021 0.195543 -0.319151 -0.456900 0.233282 0.180611 0.123653 0.146704 -0.359309 -0.308826 -0.350435 -0.142807 -0.180261 -0.124557 -0.479664 -0.147731 0.292740 0.306745 0.319353 0.236833 0.350750 0.314541 0.302139 0.307522 0.263675 0.268596 0.274956 0.261256
chargesum: 0.00000
title: Mulliken charges with hydrogens summed into heavy atoms:
elementType: Cl S S O O O O O N N N C C C C C C C C C C C C C C C C C C C
charge: -0.025689 0.914527 0.274361 -0.317772 -0.524833 -0.487392 -0.228075 -0.220235 -0.123301 -0.128585 -0.020681 -0.069806 0.530646 0.032632 0.149723 0.195543 0.000202 -0.220067 0.233282 0.180611 0.123653 0.146704 -0.057170 -0.001305 -0.086760 -0.142807 0.088335 -0.124557 -0.204709 0.113525
polarizability: 5.65465555e+02 -4.14260451e+01 3.74459229e+02 3.30704493e+00 1.94982080e+01 1.41147331e+02
1716.lowfreq: -2.9890 0.0012 0.0021 0.0023 2.7875 4.8889 11.2795 17.6707 24.9249
frequency: 10.8049 17.6004 24.9222 34.8546 39.4785 44.2918 53.8840 68.8233 78.5107 98.3111 101.1234 126.0673 141.8698 142.4935 154.8896 161.4222 176.5078 183.4248 193.0177 219.8611 259.9149 285.8886 304.5176 317.0494 328.3333 330.1267 340.6780 373.6517 381.5952 406.7397 410.7519 427.6980 437.6595 445.2689 497.0937 499.9890 509.6660 511.1911 526.7261 535.8040 540.6172 563.0265 592.4518 614.1390 624.7377 635.7457 650.1929 671.1652 706.9710 720.3296 725.8341 730.9349 734.0089 749.4662 762.2842 773.9186 794.4216 814.9274 821.3610 835.3270 837.8633 843.4843 854.8766 873.3780 874.3870 913.0893 914.9459 929.1146 946.3123 958.1906 963.0105 986.4214 1002.5528 1007.0237 1046.8556 1057.3524 1059.2729 1075.8844 1080.5485 1127.8591 1134.6405 1191.5503 1194.1141 1208.0328 1216.7257 1236.0269 1252.6762 1263.0687 1267.0255 1298.3369 1303.1340 1315.5262 1384.4369 1395.0977 1407.9199 1413.0095 1424.1343 1447.9769 1476.5210 1484.7869 1518.0535 1560.1139 1570.9015 1593.6089 1598.0209 1611.1459 1612.1090 1629.8194 3129.1155 3152.1735 3161.3885 3163.6911 3167.1574 3183.0607 3190.9404 3198.5273 3200.7810 3247.2319 3418.9365 3496.4310
redmass: 9.0182 9.8331 8.6165 8.0422 5.6513 8.1649 9.7042 8.5741 7.8100 9.1824 8.3220 8.6865 10.4477 10.4753 8.3725 11.4513 5.5991 8.3468 7.8057 9.8130 9.7576 9.3486 9.1749 8.8482 7.0002 9.4330 7.9607 4.7565 6.3976 10.8000 3.0396 3.8931 6.3587 8.4344 6.4325 5.1811 6.2222 9.1174 3.6822 6.2823 3.7700 6.4645 6.3564 6.5847 5.3050 6.9843 8.3465 4.3807 2.6950 1.7094 3.1285 1.6924 4.8923 2.5625 3.9814 2.0898 6.8364 8.5002 1.4469 1.7445 3.3407 5.2864 6.0241 1.3453 1.4225 6.3027 1.4125 1.4577 13.5859 1.3513 1.4038 5.3887 1.3420 3.0688 4.9841 2.2720 2.3483 1.2626 3.3526 1.3270 1.3957 3.5235 1.1468 3.0542 1.2722 1.9861 1.5567 2.5763 2.2346 2.2115 1.5031 2.9219 5.7010 10.5420 3.9260 5.2612 5.0926 2.6697 2.2552 5.5614 2.2758 9.3579 9.2972 7.0757 5.8479 6.6057 5.2053 8.8123 1.0896 1.0978 1.0915 1.0892 1.0929 1.0980 1.0926 1.0952 1.0919 1.1005 1.0768 1.0763
irintensity: 0.5280 0.8297 1.2618 0.5268 1.1632 0.9850 0.7033 1.0081 0.8272 1.4244 2.4529 0.8429 5.2918 5.2678 0.8014 0.2031 6.5511 5.9964 9.6927 6.6785 26.5144 23.6513 10.5140 39.4371 3.2768 4.7680 3.1780 9.3967 21.6864 31.7579 1.1514 12.2081 98.2961 17.5964 1.3250 25.2490 26.8727 2.5492 1.7279 13.9196 36.0531 69.5491 4.6257 4.9590 17.2888 40.1461 43.1113 1.6919 65.0514 22.8635 0.3727 33.0142 6.5839 23.4028 10.3164 146.2188 79.4907 87.9600 47.8172 53.4095 36.4686 2.7956 14.4408 3.0838 65.0824 22.9896 32.0151 3.7892 46.3361 1.6721 3.6743 0.9667 4.9412 118.6039 12.6999 42.6952 24.3078 6.5380 51.7748 16.2301 20.2659 9.1752 41.5341 80.8682 24.2914 3.8987 18.8915 35.8906 75.8173 1.2901 115.6413 136.6203 155.0115 10.6160 44.3994 123.7063 44.0091 129.8183 27.4990 18.8913 703.3343 200.0385 33.9328 167.8950 33.1869 78.7938 61.4592 44.0226 6.5350 30.6791 9.8185 0.6881 5.3283 1.1523 6.4530 8.7155 9.0657 1.1757 32.8751 49.8216
temp: 298.150 k
press: 1.00000 atm
elementType: 17 16 16 8 8 8 8 8 7 7 7 6 6 6 6 6 6 6 6 6 6 6 6 6 6 6 6 6 6 6 1 1 1 1 1 1 1 1 1 1 1 1
symmnumber: 1
zpe: 725742.9 jmol-1
zpe.correction: 0.276421 hartree
zpe.thermalcorrener: 0.303656 hartree
zpe.thermalcorrenthalpy: 0.304600 hartree
zpe.thermalcorrgfe: 0.214055 hartree
zpe.sumelectzpe: -2525.506033 hartree
zpe.sumelectthermal: -2525.478798 hartree
zpe.sumelectthermalent: -2525.477854 hartree
zpe.sumelectthermalfe: -2525.568399 hartree
dipole: -0.4279 7.7580 -0.7933
dipole: 7.8101
quadrupole: -226.1462 -192.2557 -202.4976
quadrupole: -3.6753 20.5780 3.6434
quadrupole: -19.1797 14.7108 4.4689 -3.6753 20.5780 3.6434
hfenergy: -2525.7824538 hartree
pointgroup: C01 [X(C19H12Cl1N3O5S2)]
dipole: -0.4151146 -2.8719519 1.0106158 debye
polarizability: 570.8979531|23.7349765|365.503146|-10.1601056|-34.1186581|144.6710164 unknown
InChI: InChI=1S/C19H12ClN3O5S2/c20-11-1-6-16-14(9-11)15(24)10-17(28-16)18(25)22-12-2-4-13(5-3-12)30(26,27)23-19-21-7-8-29-19/h1-10,22-23H
charge 0 multiplicity 1
42 atoms
Cl 8.308792 -3.353034 0.608025
S  -5.235719 1.44258 -0.898122
S  -8.26052 -0.887427 1.200134
O  3.151484 -0.329991 -0.005221
O  -5.577259 3.036251 -0.901098
O  -5.771854 0.446367 -2.064533
O  1.630061 2.926638 -0.30669
O  6.700768 1.885009 0.183002
N  0.757872 0.729385 -0.272846
N  -5.906452 0.736086 0.911694
N  -5.75046 -1.63043 0.555952
C  -3.385367 1.234665 -0.678663
C  -0.634947 0.953051 -0.408782
C  -2.594674 2.393449 -0.661185
C  -2.868329 -0.066451 -0.551017
C  5.609367 -0.282476 0.206125
C  -1.198015 2.253783 -0.530841
C  -1.47553 -0.197177 -0.415613
C  4.387416 -1.000265 0.138463
C  3.153293 1.07286 -0.079572
C  1.779211 1.672255 -0.230331
C  5.625506 1.209448 0.126897
C  4.298158 1.823213 -0.020391
C  6.817538 -1.011907 0.350728
C  4.340053 -2.407973 0.210162
C  6.768566 -2.408599 0.422064
C  5.544071 -3.120105 0.353523
C  -6.439505 -0.527984 0.867338
C  -7.872866 -2.607901 0.930744
C  -6.537068 -2.772787 0.578554
H  -3.057856 3.380895 -0.75324
H  -3.532038 -0.937305 -0.527207
H  -0.546621 3.128904 -0.52127
H  -1.039004 -1.1973 -0.30728
H  1.061844 -0.246962 -0.196072
H  -6.540061 1.489049 1.232374
H  4.209458 2.910347 -0.08574
H  7.755592 -0.450685 0.402144
H  3.380274 -2.928816 0.154323
H  5.538792 -4.211911 0.411638
H  -8.630285 -3.375541 1.074382
H  -6.077088 -3.734606 0.349345
