program: Gaussian 09
title: 000214128
version: EM64L-G09RevD.01
frameworkgroup: C1[X(C23H31NO2)]
method: RPBEPBE
basis: SDD
operation: Freq
keyword: #p
keyword: freq=noraman
keyword: PBEPBE/SDD
title: #p freq=noraman PBEPBE/SDD
converged: YES YES NO NO
title: Mulliken charges:
elementType: O O N C C C C C C C C C C C C C C C C C C C C C C C H H H H H H H H H H H H H H H H H H H H H H H H H H H H H H H
charge: -0.279077 -0.242989 -0.086616 -0.048212 -0.376718 0.022638 -0.339579 0.450057 0.357409 0.192229 -0.776840 -0.384723 -0.309445 -0.712358 -0.388177 -0.346613 -0.376295 -0.397777 -0.696772 -0.710274 -0.244476 -0.249532 -0.248888 -0.245023 -0.250107 -0.244589 0.207765 0.204321 0.240440 0.182849 0.218820 0.224978 0.240661 0.236741 0.216896 0.219742 0.206189 0.177657 0.221651 0.236639 0.213753 0.256015 0.275686 0.225261 0.249274 0.229113 0.219839 0.217242 0.228626 0.212498 0.216137 0.224310 0.227666 0.223227 0.224016 0.226820 0.227916
chargesum: 0.00000
title: Mulliken charges with hydrogens summed into heavy atoms:
elementType: O O N C C C C C C C C C C C C C C C C C C C C C C C
charge: -0.279077 -0.242989 -0.086616 -0.048212 0.035369 0.263079 0.062089 0.450057 0.357409 0.192229 -0.074460 0.051914 0.074401 -0.040316 -0.132162 -0.070928 -0.151034 -0.148503 -0.030578 -0.053014 -0.020166 -0.021866 -0.025661 -0.021007 -0.023287 -0.016673
polarizability: 3.03275704e+02 1.95556488e+01 2.69707113e+02 1.43627694e+00 -1.47626599e+01 2.00990631e+02
1716.lowfreq: -7.6340 -2.7586 0.0004 0.0006 0.0008 4.6657 13.4220 16.4025 23.8528
frequency: 11.5419 15.5935 23.6444 25.6928 35.5602 46.4523 49.7974 72.0332 75.1030 78.2608 86.0659 116.8271 141.2563 149.0813 159.9519 186.2850 206.6358 218.7179 225.0640 233.3639 246.7422 261.3456 268.2426 279.9796 293.4434 295.9508 300.5360 320.3341 350.7067 378.9890 400.6685 402.2229 405.2048 429.5404 448.5071 475.3486 493.7038 509.9020 525.0778 562.6730 590.3953 616.1705 616.8274 647.5775 693.8076 701.0753 705.6234 727.8849 740.6477 759.6770 771.3910 773.5309 777.3285 798.8429 807.3883 838.7171 847.5192 855.8646 871.5164 894.1670 917.2833 919.7761 932.7355 961.8666 973.1497 976.8356 981.3780 990.6220 990.8944 992.5050 997.3301 1014.9760 1022.5959 1024.5392 1049.9286 1056.7210 1059.9508 1070.6557 1075.3502 1078.7245 1084.3460 1089.0195 1102.6851 1111.0743 1122.6269 1142.8042 1168.1584 1172.5071 1173.7618 1188.5969 1191.6282 1196.2433 1199.2209 1201.1750 1227.2538 1231.7677 1274.1882 1282.9447 1294.7897 1319.3266 1322.0083 1325.6144 1329.7413 1340.4291 1357.0535 1372.0355 1374.7823 1376.5347 1379.4869 1384.2324 1386.7968 1389.6906 1390.8909 1432.2909 1435.6515 1447.1530 1458.7947 1463.6200 1468.5066 1470.5437 1471.4709 1476.2584 1478.0827 1479.1064 1480.3369 1483.3951 1486.4251 1487.1866 1497.4214 1587.8235 1591.0242 1604.0042 1609.6299 1614.6832 2846.9887 2862.8623 2976.5740 2983.6068 2989.2340 2992.6103 2992.6680 2997.8297 3021.5124 3022.5550 3025.8896 3041.4363 3059.7126 3072.1862 3076.2049 3079.5028 3087.4376 3088.6925 3092.5775 3098.2089 3111.5572 3119.8244 3122.9284 3126.4211 3132.9482 3139.1177 3146.7171 3146.9099 3157.0599 3162.2361 3167.2968
redmass: 4.4090 4.6504 3.3745 3.5144 4.5816 4.0381 2.3006 3.9875 3.5240 3.3133 3.7661 2.6822 2.6259 2.6866 3.0675 2.3155 1.1421 2.9990 1.3793 2.0369 2.8321 3.3230 2.8309 2.5005 1.9278 3.0798 4.1074 1.4750 2.6807 2.7209 2.7968 2.8607 2.8148 3.5372 3.0366 3.8893 3.5133 2.7597 2.5886 3.6367 4.8024 6.3637 6.3046 4.8951 6.1961 1.6527 1.7472 3.8113 3.0689 2.3485 1.9736 1.1369 2.3815 1.4671 1.2636 2.9217 1.2942 1.2562 2.7078 2.0071 1.4395 1.8677 1.5000 1.6483 1.3936 1.9034 1.3862 3.3739 4.1951 1.7946 1.3242 3.2055 2.8414 2.5012 2.4048 2.1794 2.3299 1.8958 1.9944 2.0467 2.4309 1.6617 2.0526 1.9725 1.7807 2.0457 3.2330 1.0617 1.0945 2.2973 2.8148 1.2077 1.1676 1.9766 3.2028 1.6025 1.2018 1.2752 1.1472 1.3009 1.3711 1.3191 1.3004 1.2266 1.4487 1.2824 6.7086 1.2815 7.8647 1.3271 1.2590 1.2323 1.2114 2.2096 2.2304 1.0801 1.0633 1.0491 1.0544 1.1017 1.0758 1.0522 1.0560 1.5231 1.0571 1.9677 1.2649 1.1015 1.0789 5.9352 6.2040 8.1339 6.2803 7.1007 1.0719 1.0690 1.0349 1.0364 1.0412 1.0543 1.0608 1.0355 1.0866 1.0857 1.0876 1.1006 1.1011 1.0989 1.0999 1.0998 1.1004 1.0989 1.0999 1.1004 1.1002 1.0843 1.0847 1.0873 1.0885 1.0919 1.0955 1.0937 1.0957 1.1015 1.0994
irintensity: 0.0410 0.2158 0.0654 0.1782 0.4474 0.3019 0.1713 0.4135 0.1072 0.6154 0.7472 0.3364 0.6435 4.7764 1.3842 0.3938 0.3679 1.5874 0.0091 1.2083 0.2076 1.2659 0.0252 8.8781 0.9401 0.0965 0.4809 0.5288 1.6075 3.3417 0.0572 1.6361 0.4435 4.0286 13.8329 1.1064 8.2912 0.8417 4.9351 19.9180 6.2411 0.6411 0.2675 13.1917 2.6153 44.8535 64.0689 0.3406 13.3090 2.6986 31.6282 6.1609 25.5557 9.4049 7.8778 6.0294 0.7996 0.4303 5.0786 5.8879 0.1042 13.2324 0.5173 3.2413 0.2711 9.7333 0.7882 0.0596 0.6159 0.6294 0.4015 54.1301 41.3710 27.8831 238.2156 20.9950 76.7033 16.7248 16.1924 7.5547 20.8021 1.2666 64.4694 35.3990 2.9200 9.6721 132.6354 1.8440 5.4625 11.5103 21.9608 1.4637 3.3674 16.1014 15.0956 15.0703 1.3491 15.3366 6.1778 2.5456 1.5563 0.3452 3.5967 11.4443 8.4311 9.7921 1.5149 6.5039 0.1884 30.9800 24.3141 6.7398 15.5016 18.1686 5.2508 1.5271 13.6675 4.1631 20.7498 9.0953 1.6039 7.3653 3.2382 36.0994 9.6665 7.1627 22.6960 13.2778 1.9620 0.1583 3.1919 75.4869 11.5584 47.5178 49.5750 190.9224 24.4734 30.2931 6.6307 36.6746 50.6067 14.7097 5.7585 19.5077 2.8356 10.4704 28.0792 54.3039 85.3251 41.2533 37.1092 39.5449 23.7707 27.9018 25.5986 2.4332 0.2126 0.7476 9.4609 21.2393 57.7983 5.3921 25.4542 24.0472 16.5334
temp: 298.150 k
press: 1.00000 atm
elementType: 8 8 7 6 6 6 6 6 6 6 6 6 6 6 6 6 6 6 6 6 6 6 6 6 6 6 1 1 1 1 1 1 1 1 1 1 1 1 1 1 1 1 1 1 1 1 1 1 1 1 1 1 1 1 1 1 1
symmnumber: 1
zpe: 1273412.5 jmol-1
zpe.correction: 0.485017 hartree
zpe.thermalcorrener: 0.512488 hartree
zpe.thermalcorrenthalpy: 0.513432 hartree
zpe.thermalcorrgfe: 0.423381 hartree
zpe.sumelectzpe: -1098.272752 hartree
zpe.sumelectthermal: -1098.245282 hartree
zpe.sumelectthermalent: -1098.244337 hartree
zpe.sumelectthermalfe: -1098.334388 hartree
dipole: 0.3926 -0.7431 1.4208
dipole: 1.6507
quadrupole: -146.4392 -148.1702 -157.3623
quadrupole: 4.5697 -0.8942 -1.3283
quadrupole: 4.2180 2.4870 -6.7051 4.5697 -0.8942 -1.3283
hfenergy: -1098.7577694 hartree
pointgroup: C01 [X(C23H31N1O2)]
dipole: -0.1304708 0.2351275 0.5911584 debye
polarizability: 306.9207906|15.1948976|261.331973|3.356594|22.5840982|205.7206843 unknown
InChI: InChI=1S/C23H31NO2/c1-5-24(6-2)18-17-19(3)26-22(25)23(4,20-13-9-7-10-14-20)21-15-11-8-12-16-21/h7-16,19H,5-6,17-18H2,1-4H3
charge 0 multiplicity 1
57 atoms
O  -0.156602 1.591016 0.455947
O  0.160181 0.453141 -1.550804
N  -4.465429 0.859144 -0.262946
C  1.291424 -0.369998 0.515912
C  -2.478264 2.368691 0.100704
C  -1.001194 2.639831 -0.236638
C  -3.001911 1.024261 -0.452795
C  1.158144 -1.836399 0.031696
C  2.721987 0.188566 0.262756
C  0.369235 0.562095 -0.31939
C  0.896726 -0.346801 2.019229
C  -5.086516 -0.023311 -1.286315
C  -4.826859 0.535114 1.141393
C  -0.489555 3.988189 0.275594
C  2.254283 -2.726855 0.153343
C  3.251327 0.160209 -1.056122
C  -0.088577 -2.357404 -0.398881
C  3.516807 0.73454 1.299372
C  -4.679698 -1.523533 -1.251872
C  -6.339578 0.611798 1.420544
C  2.112319 -4.098323 -0.15456
C  4.540162 0.663001 -1.327278
C  -0.2333 -3.726842 -0.709973
C  4.811854 1.236637 1.029164
C  0.867085 -4.606002 -0.588827
C  5.329433 1.203676 -0.284059
H  -3.089785 3.182188 -0.335497
H  -2.60185 2.420926 1.199403
H  -0.823868 2.525872 -1.322828
H  -2.423005 0.187646 0.013141
H  -2.790103 0.985675 -1.538126
H  1.581167 -0.994895 2.594429
H  0.917988 0.67385 2.432172
H  -0.126066 -0.740615 2.144286
H  -4.830208 0.396824 -2.277748
H  -6.184816 0.057902 -1.191237
H  -4.317443 1.271455 1.789875
H  -4.441723 -0.470896 1.451066
H  -0.622248 4.069354 1.369032
H  0.581715 4.114512 0.043622
H  -1.049456 4.811009 -0.204976
H  3.227014 -2.345967 0.483554
H  2.641193 -0.252106 -1.867339
H  -0.950972 -1.691057 -0.512494
H  3.137463 0.772731 2.324609
H  -3.589157 -1.648413 -1.3857
H  -4.967608 -2.004518 -0.299075
H  -5.183437 -2.070586 -2.070477
H  -6.739921 1.587156 1.091034
H  -6.529864 0.502782 2.504088
H  -6.902971 -0.186125 0.904327
H  2.974274 -4.768061 -0.055984
H  4.929391 0.633311 -2.351231
H  -1.203845 -4.106308 -1.050017
H  5.412751 1.652253 1.846166
H  0.756181 -5.668691 -0.832173
H  6.332122 1.593148 -0.493497
