program: Gaussian 09
title: 000214077
version: EM64L-G09RevD.01
frameworkgroup: C1[X(C21H27NO2)]
method: RPBEPBE
basis: SDD
operation: Freq
keyword: #p
keyword: freq=noraman
keyword: PBEPBE/SDD
title: #p freq=noraman PBEPBE/SDD
converged: NO YES NO NO
title: Mulliken charges:
elementType: O O N C C C C C C C C C C C C C C C C C C C C C H H H H H H H H H H H H H H H H H H H H H H H H H H H
charge: -0.468813 -0.292849 -0.084319 -0.113273 -0.439901 -0.012492 -0.433756 -0.402539 -0.449197 -0.451242 -0.332165 0.340577 0.379295 -0.424490 -0.376509 -0.380568 -0.410756 -0.262126 -0.245172 -0.231690 -0.226433 -0.501915 -0.244707 -0.246186 0.242479 0.236403 0.226819 0.222704 0.210257 0.220513 0.214257 0.231380 0.213714 0.213893 0.229024 0.242718 0.180207 0.344150 0.299321 0.239779 0.269280 0.285910 0.225875 0.223398 0.224050 0.222632 0.211948 0.200685 0.227811 0.226950 0.225069
chargesum: 0.00000
title: Mulliken charges with hydrogens summed into heavy atoms:
elementType: O O N C C C C C C C C C C C C C C C C C C C C C
charge: -0.124663 -0.292849 -0.084319 0.129206 0.023321 -0.012492 -0.000795 0.032231 -0.004103 -0.008326 0.090760 0.340577 0.379295 -0.125169 -0.136730 -0.111288 -0.124845 -0.036251 -0.021774 -0.007640 -0.003800 0.138528 -0.017757 -0.021117
polarizability: 2.47036149e+02 1.54712891e+01 2.49410706e+02 4.59292469e+00 1.36625079e+01 1.97095341e+02
1716.lowfreq: -13.5685 -10.5113 -5.2872 -0.0004 -0.0002 0.0008 8.8336 31.4822 37.8491
frequency: -4.4987 31.1947 37.6526 40.3970 45.1945 51.7798 61.9818 72.7706 83.8510 94.3593 112.3547 153.6525 194.1946 205.5868 209.3021 218.6318 226.8515 253.7564 260.9661 271.1523 286.9009 291.5175 349.2666 352.6951 395.6660 401.0478 406.8576 417.1688 462.9626 492.2553 533.5849 551.5286 615.6291 615.8104 627.8668 631.4327 636.5130 649.9429 703.5855 708.4748 713.9910 760.7432 769.7270 784.7962 829.6432 842.6800 855.6309 858.4303 864.7572 874.9231 881.7753 896.3782 905.1935 917.8748 926.2510 934.1977 937.2936 960.6011 979.1171 982.8120 989.7720 991.8915 998.2631 1000.0586 1021.2083 1024.6648 1027.1263 1031.3602 1051.1918 1059.1581 1066.3630 1074.7571 1082.3732 1103.7572 1109.0021 1119.4807 1136.2909 1146.0598 1158.5900 1170.4143 1170.6417 1171.5124 1185.3356 1188.0158 1192.7231 1201.4577 1217.0062 1237.3574 1245.6923 1252.7918 1270.6992 1279.7890 1294.3712 1298.2593 1314.0145 1318.0607 1321.1514 1322.6829 1335.6120 1359.1326 1379.1264 1380.0612 1389.3996 1429.1003 1433.0816 1435.9097 1448.6386 1457.1222 1463.5040 1469.4018 1473.0254 1475.5980 1478.2860 1479.4689 1485.4438 1492.1894 1589.2352 1590.2002 1608.3626 1611.9248 2903.1603 2923.1475 2928.0537 2981.2347 2993.6620 3000.2385 3003.1317 3003.3108 3005.9307 3018.4619 3038.1200 3053.7796 3069.7525 3080.0441 3091.6694 3098.5675 3118.1724 3121.2353 3126.4031 3130.7367 3139.5913 3144.2714 3151.0970 3157.4546 3162.7879 3176.1972 3561.6263
redmass: 3.1445 4.2473 3.6887 3.7938 3.8269 3.5593 4.5172 2.7001 2.0714 4.0065 2.3840 3.2710 2.4349 3.3205 3.2307 2.5613 2.7610 3.7976 1.2085 2.6720 4.0060 6.5130 2.1747 3.6148 2.1555 2.8459 2.8472 3.9921 3.3477 3.4632 3.3613 3.7091 6.4061 6.3406 3.5086 3.8454 3.2474 3.0233 1.8472 1.7582 3.0898 1.8023 1.9404 2.1560 1.6241 2.7088 1.2639 1.3358 2.8388 3.5005 3.0277 2.9532 2.6190 2.1511 1.7214 1.6123 1.5343 2.4434 1.4125 1.7552 5.9589 2.5330 1.3440 1.4266 2.8782 3.0417 2.3064 2.2462 6.4957 2.1380 2.2334 1.7463 1.6161 1.8724 1.7107 1.7044 2.7562 1.9262 1.5239 1.2844 1.0589 1.0699 1.4722 1.1530 1.9283 1.1891 1.1449 1.1142 1.4086 1.3334 1.5174 1.3856 1.6702 1.2276 1.4890 1.2231 1.3916 1.3440 1.3462 1.3096 6.4780 8.0812 1.3075 1.1650 2.1188 2.2349 1.0989 1.0517 1.0822 1.0791 1.0868 1.0652 2.2459 1.0896 2.0628 1.0942 5.8559 6.2743 5.9050 5.8789 1.0642 1.0658 1.0358 1.0656 1.0673 1.0928 1.0624 1.0909 1.0913 1.0636 1.0931 1.1018 1.0999 1.1013 1.1035 1.0977 1.0850 1.0846 1.0880 1.0882 1.0938 1.0926 1.0958 1.0988 1.1014 1.0953 1.0657
irintensity: 0.5978 0.1909 0.1511 0.1685 0.0402 0.8579 0.0896 0.5717 0.3917 0.2802 12.5755 1.7589 1.9467 5.6997 7.6134 1.3712 3.8126 3.0578 138.8089 5.9892 3.2202 16.1480 0.6739 30.9089 5.9773 0.5480 3.0770 0.0673 8.4401 0.5525 6.9507 2.7263 0.0399 0.0115 3.5523 25.0772 5.2452 16.1027 43.7193 64.2611 28.0599 57.5690 13.3227 31.9992 0.7741 11.4695 0.1195 3.5173 7.0193 15.3860 36.6795 10.4843 3.0083 16.1139 6.5686 12.9170 6.9899 19.4525 0.1477 0.6935 0.4314 0.2934 1.1445 0.5898 9.6101 11.3854 13.3939 4.8213 105.2407 47.9765 18.0865 15.2805 0.8945 6.0718 2.3355 1.7339 7.0689 35.5007 5.5964 3.7993 0.1920 0.5324 1.3382 1.8909 15.3662 8.6623 4.1420 10.5221 12.6734 6.9681 7.0771 0.7916 17.1087 0.5612 8.5591 1.1333 22.0942 6.3954 2.6383 1.7231 0.1530 2.4836 7.2588 4.1840 7.7457 19.7649 18.7055 10.2105 2.4579 18.2788 7.0738 3.6399 21.3737 1.3812 14.2927 11.4434 1.3908 0.6489 9.8199 3.3344 78.6178 76.8708 84.3606 55.8260 39.8497 55.9425 26.4442 48.3164 8.9136 53.5308 14.2741 16.6989 7.2808 27.6163 95.8160 29.3072 3.7147 0.7608 4.5197 16.4265 32.2401 14.3483 11.6057 29.4786 35.5469 7.6683 5.1879
temp: 298.150 k
press: 1.00000 atm
elementType: 8 8 7 6 6 6 6 6 6 6 6 6 6 6 6 6 6 6 6 6 6 6 6 6 1 1 1 1 1 1 1 1 1 1 1 1 1 1 1 1 1 1 1 1 1 1 1 1 1 1 1
symmnumber: 1
zpe: 1133594.2 jmol-1
zpe.correction: 0.431763 hartree
zpe.thermalcorrener: 0.454413 hartree
zpe.thermalcorrenthalpy: 0.455357 hartree
zpe.thermalcorrgfe: 0.378656 hartree
zpe.sumelectzpe: -1019.785002 hartree
zpe.sumelectthermal: -1019.762352 hartree
zpe.sumelectthermalent: -1019.761408 hartree
zpe.sumelectthermalfe: -1019.838109 hartree
dipole: 0.4118 -1.2290 0.1751
dipole: 1.3080
quadrupole: -136.9791 -133.3341 -139.0516
quadrupole: 3.1413 -0.3361 -1.3887
quadrupole: -0.5241 3.1208 -2.5967 3.1413 -0.3361 -1.3887
hfenergy: -1020.216765 hartree
pointgroup: C01 [X(C21H27N1O2)]
dipole: 0.2583791 0.4395344 -0.0697531 debye
polarizability: 240.6756877|-13.2325406|255.300533|-2.8258308|15.3580294|197.5659765 unknown
InChI: InChI=1S/C21H27NO2/c1-24-17-20(16-22-14-8-9-15-22)21(23,18-10-4-2-5-11-18)19-12-6-3-7-13-19/h2-7,10-13,20,23H,8-9,14-17H2,1H3
charge 0 multiplicity 1
51 atoms
O  -0.72471 0.007701 -2.128087
O  1.094309 2.951721 0.568832
N  3.178727 0.388016 -0.391113
C  0.681098 0.682341 -0.192931
C  1.851052 -0.216718 -0.683683
C  -0.695774 0.072723 -0.638381
C  4.299927 -0.251054 -1.137155
C  3.604127 0.248143 1.033706
C  4.7458 -1.500679 -0.297997
C  4.284937 -1.161214 1.159077
C  0.886279 2.143645 -0.647951
C  -1.932461 0.871012 -0.161702
C  -0.819704 -1.385523 -0.149467
C  -1.888387 1.853629 0.858573
C  -0.929014 -1.648035 1.239836
C  -3.185697 0.556933 -0.754944
C  -0.824765 -2.471254 -1.056782
C  -3.073747 2.505353 1.274069
C  -1.026922 -2.97342 1.714873
C  -4.365339 1.209241 -0.34181
C  -0.929289 -3.79885 -0.581237
C  1.485887 4.324042 0.257655
C  -4.314725 2.18774 0.679928
C  -1.026127 -4.057161 0.804898
H  0.697275 0.700193 0.914331
H  1.763151 -0.325052 -1.780583
H  1.734182 -1.233418 -0.24593
H  3.992169 -0.501283 -2.166758
H  5.137577 0.471391 -1.196767
H  2.749495 0.38635 1.715229
H  4.339356 1.044385 1.258094
H  4.247659 -2.416186 -0.663204
H  5.835852 -1.665571 -0.364539
H  5.130922 -1.135567 1.86851
H  3.566077 -1.913979 1.528555
H  1.792717 2.213365 -1.281282
H  0.006923 2.547906 -1.201076
H  -0.892996 0.925116 -2.462136
H  -0.934157 2.143744 1.309795
H  -0.960468 -0.81462 1.951884
H  -3.223498 -0.212141 -1.534072
H  -0.748842 -2.262759 -2.12707
H  -3.022057 3.266106 2.061558
H  -1.114073 -3.160375 2.791322
H  -5.323122 0.951894 -0.808488
H  -0.933782 -4.631189 -1.294651
H  2.438889 4.34864 -0.311174
H  0.702911 4.849437 -0.330866
H  1.621874 4.83762 1.222851
H  -5.230305 2.693952 1.006454
H  -1.106714 -5.086594 1.172109
