program: Gaussian 09
title: 000214075
version: EM64L-G09RevD.01
frameworkgroup: C1[X(C21H27NO3)]
method: RPBEPBE
basis: SDD
operation: Freq
keyword: #p
keyword: freq=noraman
keyword: PBEPBE/SDD
title: #p freq=noraman PBEPBE/SDD
converged: YES YES NO NO
title: Mulliken charges:
elementType: O O O N C C C C C C C C C C C C C C C C C C C C C H H H H H H H H H H H H H H H H H H H H H H H H H H H
charge: -0.467111 -0.246434 -0.296658 -0.100627 -0.132996 -0.020916 -0.445972 -0.344810 -0.343331 -0.335558 0.333941 0.389840 -0.335796 -0.322924 -0.421274 -0.377102 -0.380183 -0.413241 -0.261676 -0.243594 -0.231243 -0.225903 -0.502911 -0.243869 -0.244826 0.255608 0.241680 0.222410 0.243855 0.187427 0.243730 0.192935 0.191654 0.206904 0.187919 0.212110 0.211739 0.185450 0.346007 0.290615 0.238895 0.270047 0.286390 0.227070 0.224138 0.225625 0.223418 0.209994 0.205034 0.229903 0.228590 0.226025
chargesum: 0.00000
title: Mulliken charges with hydrogens summed into heavy atoms:
elementType: O O O N C C C C C C C C C C C C C C C C C C C C C
charge: -0.121104 -0.246434 -0.296658 -0.100627 0.122612 -0.020916 0.018119 0.086471 0.093334 0.063001 0.333941 0.389840 0.064232 0.074265 -0.130658 -0.138207 -0.110136 -0.126851 -0.034606 -0.019455 -0.005617 -0.002485 0.142019 -0.015279 -0.018800
polarizability: 2.47140253e+02 -6.29135050e+00 2.60037988e+02 1.91543964e+00 -1.64878879e+01 1.99713222e+02
1716.lowfreq: -7.4816 -6.4094 -0.0006 -0.0004 0.0006 6.1757 28.4846 32.8929 36.8015
frequency: 28.3725 32.8819 36.7648 40.5005 49.3922 54.7519 60.7227 75.0369 94.5946 111.0727 149.6236 176.0505 186.3699 207.6099 213.0752 219.8924 239.1012 253.1271 256.3906 262.1789 285.0341 288.6298 314.1698 318.3945 350.3583 396.8163 401.2452 405.7754 416.3758 439.9939 459.1472 470.4956 501.6778 533.3333 559.7721 593.3226 615.8804 616.4552 631.9052 649.6257 703.8000 708.8994 718.0839 761.4109 771.0886 788.5017 810.0356 840.0255 856.8230 858.8192 863.0011 882.1054 891.2583 902.8489 919.3647 928.2778 938.6549 960.2718 980.2339 983.5252 989.8551 992.3103 999.3998 1000.6339 1006.8971 1027.7140 1029.3150 1031.3683 1037.3848 1050.2133 1053.6007 1076.2076 1082.6092 1087.2491 1102.7881 1108.8212 1116.6319 1121.5817 1144.4309 1149.5438 1154.4335 1159.8338 1171.3182 1172.6691 1188.6072 1190.7285 1193.7247 1201.5828 1225.5476 1242.3935 1264.0575 1271.3522 1284.3566 1293.7744 1300.1386 1320.4325 1321.8499 1330.1232 1334.8474 1340.9310 1364.8929 1371.2730 1378.7356 1379.2340 1381.0038 1394.1041 1430.1537 1434.0611 1436.3574 1442.1429 1445.1682 1448.5087 1450.9341 1456.7369 1456.8155 1473.7008 1477.9802 1479.4095 1484.8517 1588.9015 1591.2206 1608.6944 1612.2482 2859.6333 2867.9861 2898.1959 2915.5621 2930.5261 2945.3971 2950.2368 3000.4029 3004.9689 3006.7990 3019.6926 3025.9023 3053.6961 3076.7151 3080.2721 3100.3666 3118.2526 3122.1994 3126.7968 3130.4419 3140.1423 3142.5399 3149.9063 3157.9869 3163.3305 3175.0073 3562.4109
redmass: 4.8615 3.8746 3.9273 3.4068 4.1592 3.5310 4.5477 3.8865 4.2205 2.1462 3.8403 6.1958 3.1736 2.8452 3.1034 1.8123 1.9438 3.4493 1.3985 2.5849 4.7828 5.0525 2.3701 2.3689 3.7979 1.9679 2.8366 2.8420 3.8266 5.1192 3.2523 3.0139 3.8379 3.4472 3.5197 2.1765 6.3735 6.4166 5.1112 4.3223 1.8666 1.7290 3.6283 1.7883 2.4868 3.0160 3.8008 1.6137 1.2842 1.5180 2.2936 3.0272 2.9799 2.6378 2.0828 1.6620 1.5576 2.3902 1.4176 1.7907 6.0035 2.6307 1.3344 1.3711 2.6558 2.2138 2.1901 2.2537 2.8430 7.7020 2.0669 2.2508 1.6236 2.5951 1.8539 1.9095 2.0259 1.8422 2.1279 2.5261 2.4264 1.7189 1.0563 1.0657 1.1724 1.5831 1.4437 1.1947 1.1674 1.1383 1.3282 1.3389 1.5902 1.3930 1.4482 1.2498 1.3873 1.2788 1.3272 1.2486 1.3624 1.3557 1.4407 5.1198 6.7499 1.3674 1.1649 2.1130 2.2361 1.0824 1.0801 1.0956 1.0968 1.0582 1.0867 1.0812 1.1035 2.1858 2.0565 5.8582 6.3244 5.9094 5.9636 1.0704 1.0693 1.0670 1.0612 1.0358 1.0670 1.0670 1.0939 1.0947 1.0943 1.0902 1.0906 1.0893 1.0955 1.0970 1.0978 1.0855 1.0847 1.0878 1.0880 1.0937 1.0926 1.0959 1.0985 1.1015 1.0957 1.0659
irintensity: 0.0313 0.3542 0.2141 0.2829 0.0963 0.1135 0.0065 0.1055 0.9685 16.3531 2.9102 1.2558 5.1461 5.3503 4.1581 14.4296 4.8222 10.7376 118.1441 10.0939 12.4118 8.0231 4.6261 12.5732 26.5045 0.6253 0.5450 1.6891 0.3030 5.2334 7.6340 4.9698 1.2236 6.5107 2.3826 0.8592 0.0848 0.0350 16.8542 21.0394 44.1527 66.7638 15.7670 58.8615 30.4599 15.5016 30.6212 0.3341 0.1359 2.7242 3.0149 37.4229 10.8108 5.6700 12.9299 11.9065 7.1022 25.9499 0.2384 0.3432 0.5028 0.9641 0.9966 0.0988 27.2715 7.1134 13.3551 6.7968 39.9969 94.5196 23.0184 0.9595 2.3133 33.0192 4.7553 3.9060 24.8132 0.4976 41.5508 55.2581 5.6556 3.3431 0.1963 0.5448 1.2574 4.0025 7.5562 8.6952 13.9485 3.5776 24.6128 5.5377 7.0089 12.8770 12.0391 1.5866 22.6048 4.3444 3.5017 6.1688 0.3973 1.4431 4.1665 0.0733 1.9677 6.1261 2.9199 6.8630 21.2546 2.0029 0.2098 6.0541 26.7583 6.9313 9.9398 10.6207 5.1144 25.6580 13.5828 1.6743 0.5032 8.0231 3.7405 41.3114 96.3766 94.4074 72.5697 88.8362 31.4864 120.0578 40.1871 53.2543 5.7670 24.2173 37.3068 10.1770 43.5573 38.0456 26.9421 4.7909 0.9803 3.5531 11.4865 31.3114 7.1660 18.9328 29.2236 32.9230 8.4512 5.6360
temp: 298.150 k
press: 1.00000 atm
elementType: 8 8 8 7 6 6 6 6 6 6 6 6 6 6 6 6 6 6 6 6 6 6 6 6 6 1 1 1 1 1 1 1 1 1 1 1 1 1 1 1 1 1 1 1 1 1 1 1 1 1 1 1
symmnumber: 1
zpe: 1145703.7 jmol-1
zpe.correction: 0.436375 hartree
zpe.thermalcorrener: 0.460519 hartree
zpe.thermalcorrenthalpy: 0.461463 hartree
zpe.thermalcorrgfe: 0.381267 hartree
zpe.sumelectzpe: -1094.916707 hartree
zpe.sumelectthermal: -1094.892564 hartree
zpe.sumelectthermalent: -1094.891620 hartree
zpe.sumelectthermalfe: -1094.971816 hartree
dipole: 1.7199 -2.0227 -1.0546
dipole: 2.8568
quadrupole: -162.4959 -135.3644 -142.3792
quadrupole: 1.3134 6.0890 -0.0892
quadrupole: -15.7494 11.3821 4.3673 1.3134 6.0890 -0.0892
hfenergy: -1095.353083 hartree
pointgroup: C01 [X(C21H27N1O3)]
dipole: -0.6732044 -0.838845 0.3262295 debye
polarizability: 247.0329481|5.8702151|256.0661891|2.6673844|22.4053604|203.7923255 unknown
InChI: InChI=1S/C21H27NO3/c1-24-17-20(16-22-12-14-25-15-13-22)21(23,18-8-4-2-5-9-18)19-10-6-3-7-11-19/h2-11,20,23H,12-17H2,1H3
charge 0 multiplicity 1
52 atoms
O  -1.008879 -0.014488 2.151194
O  5.630463 0.303195 -0.501405
O  1.13348 -2.605306 -0.668246
N  2.864313 0.109196 0.386573
C  0.400098 -0.441461 0.150035
C  -1.017158 0.000996 0.660003
C  1.477209 0.573342 0.625502
C  0.765977 -1.883257 0.56605
C  3.217443 0.027801 -1.056119
C  3.854121 0.947748 1.110724
C  -2.174382 -0.899978 0.168047
C  -1.302623 1.461963 0.253361
C  4.642273 -0.522966 -1.21714
C  5.268587 0.376272 0.923701
C  -2.048457 -1.837517 -0.887879
C  -1.48591 1.78086 -1.116144
C  -3.442022 -0.739571 0.790838
C  -1.378777 2.495031 1.216825
C  -3.166742 -2.595467 -1.308494
C  -1.72853 3.111926 -1.517081
C  -4.554801 -1.497842 0.37307
C  -1.627427 3.828021 0.815498
C  1.628923 -3.952043 -0.390651
C  -4.422158 -2.430629 -0.683308
C  -1.798913 4.143808 -0.551171
H  0.368439 -0.43481 -0.956594
H  1.35236 0.71737 1.715963
H  1.288641 1.559949 0.139676
H  1.637617 -1.873214 1.249884
H  -0.084761 -2.415145 1.048828
H  2.515274 -0.660399 -1.5585
H  3.150725 1.032812 -1.545195
H  3.839553 2.006668 0.747379
H  3.59839 0.955921 2.187829
H  4.678499 -1.565639 -0.831891
H  4.958004 -0.506986 -2.273501
H  6.027051 1.028626 1.387942
H  5.321439 -0.638747 1.375215
H  -1.113061 -0.955695 2.442073
H  -1.080419 -2.007542 -1.370924
H  -1.460054 0.984996 -1.870243
H  -3.546078 -0.004338 1.59618
H  -1.247007 2.242573 2.272188
H  -3.051589 -3.317711 -2.124881
H  -1.871346 3.343039 -2.578831
H  -5.525179 -1.357662 0.862886
H  -1.685904 4.619535 1.57161
H  2.53355 -3.922572 0.252435
H  0.854999 -4.574421 0.107521
H  1.884671 -4.399332 -1.364402
H  -5.285949 -3.018662 -1.013531
H  -1.991078 5.177354 -0.8607
