program: Gaussian 09
title: 000214019
version: EM64L-G09RevD.01
frameworkgroup: C1[X(C23H23N)]
method: RPBEPBE
basis: SDD
operation: Freq
keyword: #pfreq=noraman
keyword: PBEPBE/SDD
title: #p freq=noraman PBEPBE/SDD
converged: YES YES NO NO
title: Mulliken charges:
elementType: N C C C C C C C C C C C C C C C C C C C C C C C H H H H H H H H H H H H H H H H H H H H H H H
charge: -0.058977 -0.168890 -0.168872 -0.471761 -0.471618 -0.559217 -0.558402 0.315179 -0.653688 -0.057662 0.198344 0.198018 0.377084 0.378165 -0.389005 -0.389299 -0.440017 -0.440244 -0.435619 -0.435882 -0.253106 -0.252945 -0.249903 -0.249881 0.229210 0.229372 0.225832 0.228843 0.228749 0.225417 0.217849 0.237108 0.236700 0.217708 0.227316 0.226988 0.196614 0.247518 0.247468 0.210696 0.210632 0.239863 0.239914 0.228932 0.228923 0.228277 0.228271
chargesum: 0.00000
title: Mulliken charges with hydrogens summed into heavy atoms:
elementType: N C C C C C C C C C C C C C C C C C C C C C C C
charge: -0.058977 0.060319 0.060500 -0.017086 -0.017452 -0.104260 -0.103995 0.315179 -0.002770 -0.057662 0.198344 0.198018 0.377084 0.378165 -0.141487 -0.141830 -0.229322 -0.229612 -0.195756 -0.195967 -0.024174 -0.024022 -0.021626 -0.021610
polarizability: 2.42466598e+02 3.18993281e-01 3.10914318e+02 -2.32332751e+01 8.90119888e-02 2.14052021e+02
1716.lowfreq: -0.0007 -0.0006 -0.0004 7.6804 10.5840 15.6175 35.9074 58.4624 59.1555
frequency: 35.8410 57.9496 59.1525 66.6909 97.1329 111.9516 145.9464 164.8856 176.5587 193.9794 217.3310 223.4398 256.5473 293.1766 312.4229 331.4916 354.4787 361.7303 362.2279 386.4925 431.4993 437.7334 471.1420 472.8669 496.3587 514.5822 533.7682 556.5157 588.3159 619.8660 623.1952 665.5186 673.8554 707.0145 722.2146 728.1047 740.4209 746.0968 749.8482 774.4692 779.1737 784.4601 808.4276 817.2611 821.2745 849.9810 857.7621 872.4552 884.8463 890.8321 909.7752 919.2133 953.5934 956.5834 970.8894 975.8553 981.1073 981.7761 985.4712 988.7561 1013.2438 1038.3034 1043.7588 1055.3391 1066.7956 1093.5363 1103.6662 1111.4715 1124.7601 1126.6140 1141.2801 1161.4456 1172.7367 1173.3555 1180.5103 1187.6717 1203.3850 1218.1886 1223.3990 1228.3214 1237.5334 1248.4631 1249.4464 1256.9607 1270.4461 1285.6780 1287.5697 1297.0411 1318.4531 1320.5002 1335.7596 1351.1039 1371.5220 1378.2833 1406.2456 1418.9311 1426.7250 1439.9628 1449.6013 1452.7768 1461.9520 1463.4124 1475.1044 1481.3353 1481.5586 1483.5623 1558.0986 1565.8177 1599.9746 1602.0876 1631.2233 1634.4701 2884.4518 2974.4320 2977.0420 3000.9575 3013.6746 3020.8150 3033.7387 3042.7927 3057.7945 3061.9044 3062.5133 3075.2543 3081.9758 3081.9992 3109.0689 3117.7300 3118.3296 3127.4832 3128.1492 3142.1672 3142.7174 3160.9773 3161.4285
redmass: 4.0432 3.7572 4.8821 3.8975 4.1358 4.1206 2.1327 3.7311 3.6408 1.0435 3.8685 3.4448 2.7632 3.6131 4.9675 4.8272 2.2730 2.5326 2.6367 3.4166 4.4193 2.6462 4.1346 2.9848 3.4718 4.8358 4.3433 3.7790 3.2024 3.6067 6.2363 5.4710 6.0240 5.2452 1.8135 3.0819 3.2873 2.6044 2.4026 1.7678 1.8849 2.9346 1.6369 2.7066 3.0311 2.4949 2.4279 1.7999 1.8703 1.7597 3.0022 4.4999 1.4131 1.3998 2.1246 2.1005 1.3270 2.4128 1.3279 1.3222 2.3923 2.4706 2.1773 2.2439 1.6257 2.2707 1.8237 1.8238 1.3815 1.8781 1.1791 1.9639 1.1046 1.0667 1.9852 1.3509 1.5079 3.2382 1.9927 1.4218 1.3305 1.6878 1.4359 1.4543 1.4296 1.4945 1.4626 1.6368 1.9578 1.5402 1.7881 1.4669 10.5745 5.4120 1.6169 2.0653 1.1671 1.0892 1.0949 2.2557 1.0755 1.0588 2.4671 1.0790 1.0633 3.0240 6.7249 6.6364 5.9923 6.1509 7.4120 8.9160 1.0528 1.0644 1.0646 1.0606 1.0644 1.0761 1.0864 1.0890 1.1005 1.0966 1.0959 1.1006 1.0836 1.1047 1.0944 1.0863 1.0864 1.0880 1.0880 1.0940 1.0940 1.1007 1.1007
irintensity: 0.1508 0.1118 0.2918 0.0045 0.9203 0.0708 0.0782 1.4549 1.5287 0.0164 0.1393 1.2155 0.7931 6.0759 0.1281 1.1469 1.5679 2.4422 0.4995 0.7829 0.8427 1.2032 5.7083 16.5594 0.1956 3.1515 0.2912 4.0931 0.0007 7.6492 5.7968 6.8645 2.1498 0.2043 0.5517 12.2350 0.7232 3.4090 49.2275 20.6930 9.6316 22.7427 79.1820 1.7986 7.4002 4.9022 4.9235 0.4253 4.4081 1.8682 1.6935 0.4553 0.0885 7.6467 7.4745 0.0467 1.2464 3.7245 0.0343 0.8111 40.8194 4.2026 4.4844 6.7266 8.7768 3.6069 0.1102 5.6830 0.8109 26.1761 7.2571 7.2690 0.2898 0.1039 3.8915 1.0279 4.1227 1.2624 4.1271 3.7521 9.3140 0.4643 0.6542 0.1331 0.0780 1.8861 6.4534 22.0419 1.1688 13.9820 0.1306 11.1589 0.1496 2.0890 0.9396 10.5515 4.4015 7.5665 8.5262 4.1790 10.7359 12.5080 3.0707 17.6466 9.5199 21.3255 2.1878 0.4526 4.5127 0.0350 0.0378 14.0039 115.2954 11.5739 22.5427 13.3077 36.3868 60.6885 62.0160 40.1667 8.3784 10.9276 11.2752 33.8125 0.2862 76.5310 28.1949 0.1624 20.8388 0.9178 6.8405 9.8668 44.1445 61.2078 14.3669
temp: 298.150 k
press: 1.00000 atm
elementType: 7 6 6 6 6 6 6 6 6 6 6 6 6 6 6 6 6 6 6 6 6 6 6 6 1 1 1 1 1 1 1 1 1 1 1 1 1 1 1 1 1 1 1 1 1 1 1
symmnumber: 1
zpe: 1034405.5 jmol-1
zpe.correction: 0.393984 hartree
zpe.thermalcorrener: 0.413229 hartree
zpe.thermalcorrenthalpy: 0.414173 hartree
zpe.thermalcorrgfe: 0.347119 hartree
zpe.sumelectzpe: -943.278685 hartree
zpe.sumelectthermal: -943.259440 hartree
zpe.sumelectthermalent: -943.258496 hartree
zpe.sumelectthermalfe: -943.325550 hartree
dipole: 0.5703 0.0017 0.9112
dipole: 1.0750
quadrupole: -139.1593 -129.5734 -134.7953
quadrupole: 0.0459 -1.8546 0.0027
quadrupole: -4.6500 4.9360 -0.2859 0.0459 -1.8546 0.0027
hfenergy: -943.6726692 hartree
pointgroup: C01 [X(C23H23N1)]
dipole: -0.2174111 0.0015218 0.36277 debye
polarizability: 243.4428637|2.3007238|310.8181397|22.6939411|0.5421351|213.1719345 unknown
InChI: InChI=1S/C23H23N/c1-24-19-12-13-20(24)15-18(14-19)23-21-8-4-2-6-16(21)10-11-17-7-3-5-9-22(17)23/h2-11,19-20H,12-15H2,1H3
charge 0 multiplicity 1
47 atoms
N  -3.963149 0.145084 -0.370178
C  -3.198395 -1.047835 0.11808
C  -3.115408 1.261412 0.159612
C  -2.808552 -0.71542 1.604834
C  -2.755217 0.849547 1.633769
C  -1.934512 -1.198419 -0.774398
C  -1.842142 1.353088 -0.727612
C  -1.053086 0.045842 -0.695486
C  -5.36677 0.186738 0.102668
C  0.311583 -0.007386 -0.525628
C  1.156596 1.227342 -0.424556
C  1.063335 -1.303694 -0.463298
C  1.916135 1.510646 0.758282
C  1.794675 -1.678297 0.711856
C  1.181364 2.160912 -1.494003
C  1.022713 -2.204305 -1.560242
C  2.037735 0.580374 1.889027
C  1.984298 -0.793104 1.869235
C  2.603214 2.758025 0.849794
C  2.384903 -2.976221 0.767936
C  1.897999 3.372494 -1.401987
C  1.644741 -3.469114 -1.502382
C  2.603072 3.679768 -0.213266
C  2.318975 -3.863988 -0.32166
H  -3.820524 -1.956138 0.029627
H  -3.670472 2.214625 0.103566
H  -1.837509 -1.165615 1.874666
H  -3.567179 -1.105448 2.306949
H  -3.489335 1.264044 2.347784
H  -1.757649 1.222823 1.923599
H  -2.286443 -1.342925 -1.815843
H  -1.374485 -2.102981 -0.481524
H  -1.218927 2.203835 -0.402544
H  -2.18091 1.560984 -1.762708
H  -5.91532 -0.675627 -0.316856
H  -5.847309 1.1079 -0.273085
H  -5.487876 0.163932 1.212496
H  0.618719 1.925966 -2.404484
H  0.483417 -1.900892 -2.464633
H  2.314207 1.047354 2.845332
H  2.222552 -1.307382 2.811486
H  3.161907 2.984723 1.766229
H  2.921039 -3.271108 1.678384
H  1.896368 4.076007 -2.241873
H  1.593008 -4.145607 -2.362636
H  3.150116 4.624573 -0.122485
H  2.791398 -4.850332 -0.257443
