program: Gaussian 09
title: 000214045
version: EM64L-G09RevD.01
frameworkgroup: C1[X(C22H29ClN2O2)]
method: RPBEPBE
basis: SDD
operation: Freq
keyword: #p
keyword: freq=noraman
keyword: PBEPBE/SDD
title: #p freq=noraman PBEPBE/SDD
converged: YES YES NO NO
title: Mulliken charges:
elementType: Cl O O N N C C C C C C C C C C C C C C C C C C C C C C H H H H H H H H H H H H H H H H H H H H H H H H H H H H H
charge: -0.075365 -0.277881 -0.484252 -0.195268 -0.090626 -0.356003 -0.351282 -0.388460 -0.386503 -0.386262 -0.410635 -0.474881 -0.162312 -0.175691 0.443767 0.425656 -0.426857 -0.384823 -0.388946 -0.393560 -0.510620 -0.227154 -0.229715 -0.243200 -0.225210 -0.210041 -0.101488 0.212244 0.212338 0.213586 0.199852 0.203354 0.239084 0.212276 0.193293 0.208463 0.242467 0.222905 0.227341 0.215184 0.243174 0.190417 0.186960 0.239556 0.264436 0.396503 0.229757 0.294234 0.200929 0.231954 0.223671 0.226147 0.226902 0.228828 0.250690 0.251065
chargesum: 0.00000
title: Mulliken charges with hydrogens summed into heavy atoms:
elementType: Cl O O N N C C C C C C C C C C C C C C C C C C C C C C
charge: -0.075365 -0.277881 -0.087749 -0.195268 -0.090626 0.068579 0.062156 0.053978 0.019066 0.064667 0.039611 -0.016522 0.028105 0.011268 0.443767 0.425656 -0.187300 -0.120387 -0.159189 -0.099325 0.145935 -0.001007 -0.002813 -0.014372 0.025480 0.041024 -0.101488
polarizability: 3.28157439e+02 1.18159153e+01 2.61262436e+02 -2.41274825e+00 1.08920126e+01 2.00253731e+02
1716.lowfreq: -6.5244 -5.2626 0.0018 0.0022 0.0022 5.6370 9.8267 16.6332 17.1431
frequency: 8.0190 16.3348 17.1256 27.6835 34.4173 47.9686 56.1991 66.1351 83.6487 92.9259 114.0120 137.7076 144.6113 153.1726 171.0581 190.8669 212.3095 221.7565 240.9487 253.9004 268.4497 275.9631 290.4746 308.7793 326.6434 353.8030 374.9384 401.7513 403.8761 408.8680 409.5211 418.6242 441.7508 461.2492 480.3710 488.3319 517.9640 560.1622 591.7194 595.3223 614.6707 618.3181 625.5322 649.8826 706.8887 714.4664 738.3505 755.9101 759.3008 773.5380 775.8992 819.8980 841.3556 844.7196 857.7165 858.6852 900.5505 914.0195 922.1385 928.2977 942.2549 951.3841 961.2204 979.7201 982.9117 986.2159 992.0711 998.2254 1000.1449 1008.3022 1021.3379 1026.7573 1038.0330 1052.0610 1063.0587 1064.3326 1068.4703 1074.1830 1081.6408 1098.9735 1107.8693 1117.9852 1128.3371 1135.1958 1143.1031 1149.8960 1164.7370 1171.3888 1174.6514 1182.3746 1195.3525 1202.7627 1206.2686 1211.5595 1233.2345 1253.0489 1272.1400 1279.1236 1285.0895 1291.0544 1295.7369 1308.8148 1311.8673 1313.6852 1327.3325 1337.6017 1340.0882 1345.6652 1360.2148 1367.5539 1381.0335 1385.9628 1386.5727 1389.6714 1390.3575 1431.6452 1442.7697 1450.8753 1453.1799 1457.7356 1457.8711 1461.8054 1465.1223 1468.5337 1472.1635 1474.3295 1478.0657 1480.8664 1491.5176 1588.5119 1592.2635 1600.9704 1610.5373 2857.0607 2864.1147 2893.7374 2903.7215 2904.3296 2909.1904 2936.5728 2939.6086 2950.8814 2972.1317 2993.5085 3021.3725 3034.7271 3037.1229 3039.3577 3046.4641 3050.8434 3061.4038 3067.6286 3103.1728 3119.0024 3120.9019 3124.5943 3136.4238 3146.0821 3157.4184 3162.1888 3167.6333 3180.2958
redmass: 5.8302 5.6889 4.2079 4.4278 4.7253 4.2827 5.0797 5.0024 3.5914 3.4528 2.9830 4.5670 4.3053 2.7559 1.6664 4.4722 3.4338 3.3286 2.8163 1.9612 2.9750 3.5105 4.0461 4.1810 3.2305 2.3207 4.9608 3.3028 2.8966 2.9632 4.1852 2.3871 3.2950 4.8943 3.6052 3.4780 2.9863 2.6232 3.9284 3.8668 6.1342 2.7337 5.4618 3.6176 1.7548 3.5375 2.5334 3.4808 2.8374 2.2155 3.0117 1.4142 1.3265 1.5477 1.2634 2.7566 3.7688 2.2386 1.8771 1.6270 1.2866 1.2836 2.3624 1.4024 1.4133 2.8349 3.3324 1.3220 4.1822 2.3584 2.8123 2.3332 3.9696 1.9663 2.7032 2.8047 2.6770 2.2978 1.6828 1.9591 1.5847 1.2661 2.6823 2.7987 1.8950 2.4016 1.6814 1.0580 1.1244 1.1187 1.0966 1.4287 2.5309 1.7967 1.2789 1.5531 1.2347 1.2577 1.4733 1.5611 1.2287 1.2645 1.3830 1.2391 1.2966 1.2893 1.3434 1.3996 1.3616 1.4593 4.9317 2.9386 1.6103 1.6658 2.4353 1.2337 1.8364 1.2443 1.0940 1.0813 1.0549 1.1157 1.0826 1.0926 1.1629 1.7653 1.0587 2.0400 1.3607 7.5456 6.0644 6.2418 6.0570 1.0715 1.0702 1.0811 1.0688 1.0689 1.0695 1.0587 1.0506 1.0739 1.0674 1.0616 1.1010 1.0936 1.0907 1.0927 1.0946 1.0912 1.0989 1.0882 1.0989 1.0850 1.0896 1.0871 1.0918 1.0963 1.0896 1.1014 1.0951 1.0958
irintensity: 0.0672 0.0375 0.1135 0.1979 0.2419 1.4566 0.4209 0.2998 0.5714 3.7597 3.3152 2.0794 3.9530 2.6743 0.4284 0.1355 0.2001 2.9699 7.4187 0.1994 1.4477 1.1888 0.6127 0.9628 6.5728 19.7428 2.1982 3.8852 0.1247 0.0965 1.5094 11.0434 2.8516 6.9856 3.4181 2.3234 21.0498 28.4992 7.4444 6.0469 0.2186 2.6967 1.5881 24.6601 61.7524 5.1338 3.6623 14.0297 12.2234 19.8925 30.5813 46.4617 30.7067 0.3358 0.1801 5.2611 8.7041 36.4480 7.0807 6.5028 31.4113 46.4496 12.9433 0.0096 6.3346 6.7624 9.7484 0.9928 55.7172 22.3581 59.0875 6.0019 96.0785 4.9748 4.1304 19.6831 28.6213 10.6408 8.1076 18.1377 2.1355 0.0666 16.1361 25.2507 39.3663 65.4703 4.4649 0.1023 2.8535 0.2599 2.0197 4.7962 10.9619 7.4580 10.1531 4.8265 2.9291 7.1418 17.0558 6.4528 2.1114 0.3235 22.4729 15.9559 4.1365 23.2132 9.0091 15.1692 9.9153 5.3134 2.1909 1.4327 1.1505 3.4331 13.1885 5.4080 11.3681 113.6505 6.4837 8.2624 8.0688 24.1498 1.9176 1.3782 12.1685 64.0082 8.9036 12.2017 42.5452 3.3701 0.8025 4.5344 2.1070 44.2608 85.2256 109.1474 24.4994 254.7568 209.2593 35.7102 55.1786 84.0327 673.6634 31.2002 50.2741 17.9006 12.8578 13.6600 54.7387 52.2273 47.7155 16.1147 32.7152 3.7328 16.7454 0.3786 13.2316 33.5342 2.2981 22.7737 5.3949 2.1623
temp: 298.150 k
press: 1.00000 atm
elementType: 17 8 8 7 7 6 6 6 6 6 6 6 6 6 6 6 6 6 6 6 6 6 6 6 6 6 6 1 1 1 1 1 1 1 1 1 1 1 1 1 1 1 1 1 1 1 1 1 1 1 1 1 1 1 1 1
symmnumber: 1
zpe: 1229811.2 jmol-1
zpe.correction: 0.468410 hartree
zpe.thermalcorrener: 0.494728 hartree
zpe.thermalcorrenthalpy: 0.495672 hartree
zpe.thermalcorrgfe: 0.407015 hartree
zpe.sumelectzpe: -1573.665202 hartree
zpe.sumelectthermal: -1573.638884 hartree
zpe.sumelectthermalent: -1573.637940 hartree
zpe.sumelectthermalfe: -1573.726597 hartree
dipole: -6.0812 0.6402 3.2899
dipole: 6.9436
quadrupole: -200.4141 -156.5823 -167.7206
quadrupole: -1.2304 2.9773 -2.7690
quadrupole: -25.5084 18.3233 7.1851 -1.2304 2.9773 -2.7690
hfenergy: -1574.1336119 hartree
pointgroup: C01 [X(C22H29Cl1N2O2)]
dipole: -2.190501 0.1241506 1.6276527 debye
polarizability: 320.0918632|18.8614304|266.4740694|-23.9122027|-0.0913487|203.1076726 unknown
InChI: InChI=1S/C22H29ClN2O2/c1-27-22(19-5-3-2-4-6-19)17-25-15-13-24(14-16-25)12-11-21(26)18-7-9-20(23)10-8-18/h2-10,21-22,26H,11-17H2,1H3
charge 0 multiplicity 1
56 atoms
Cl 8.734834 1.763582 -2.367745
O  -5.615633 -2.049436 -0.477306
O  2.844793 -1.310445 -0.920294
N  0.820585 -1.142631 0.833037
N  -1.979979 -1.618862 0.241243
C  -0.145207 -0.015433 0.683634
C  0.112532 -2.354845 1.338227
C  -1.289045 -0.409153 -0.262649
C  -1.030347 -2.744763 0.385783
C  2.003566 -0.792765 1.679849
C  -3.231708 -1.951127 -0.475406
C  2.934988 0.263363 1.030176
C  -4.494805 -1.480638 0.294666
C  3.095585 0.072681 -0.526232
C  -4.602182 0.034712 0.431522
C  4.480933 0.488181 -1.004405
C  -4.261283 0.678727 1.645574
C  -5.017403 0.822011 -0.673658
C  4.865156 1.85252 -0.986087
C  5.408499 -0.480835 -1.454875
C  -6.902799 -1.948261 0.215075
C  -4.319486 2.08779 1.753236
C  -5.081766 2.228526 -0.567245
C  -4.72852 2.866929 0.646215
C  6.157336 2.250426 -1.396378
C  6.7056 -0.101737 -1.871013
C  7.059093 1.259761 -1.830613
H  -0.573558 0.265536 1.674915
H  0.385496 0.862204 0.274699
H  0.842341 -3.183061 1.405697
H  -0.307756 -2.17177 2.35542
H  -0.870655 -0.575151 -1.287955
H  -2.012604 0.421296 -0.321406
H  -1.565414 -3.616068 0.805384
H  -0.589452 -3.052043 -0.596411
H  1.683304 -0.439871 2.688151
H  2.573079 -1.728839 1.819612
H  -3.256257 -1.519588 -1.499863
H  -3.320787 -3.047429 -0.587463
H  2.572811 1.289795 1.232563
H  3.921523 0.172793 1.521326
H  -4.463494 -1.939504 1.308271
H  2.347377 0.734771 -1.022728
H  -3.94371 0.074561 2.503881
H  -5.302819 0.318628 -1.604897
H  1.923811 -1.49856 -0.511923
H  4.154944 2.620582 -0.655092
H  5.090811 -1.52631 -1.48812
H  -6.86869 -2.462379 1.198977
H  -7.637119 -2.449064 -0.43555
H  -7.203187 -0.892974 0.371296
H  -4.053042 2.57579 2.697831
H  -5.407631 2.827457 -1.425445
H  -4.778467 3.958543 0.729158
H  6.45268 3.303535 -1.385062
H  7.421928 -0.849763 -2.223798
