program: Gaussian 09
title: 000214021
version: EM64L-G09RevD.01
frameworkgroup: C1[X(C24H26N)]
method: RPBEPBE
basis: SDD
operation: Freq
keyword: #p
keyword: freq=noraman
keyword: PBEPBE/SDD
title: #p freq=noraman PBEPBE/SDD
converged: YES YES NO NO
title: Mulliken charges:
elementType: N C C C C C C C C C C C C C C C C C C C C C C C C H H H H H H H H H H H H H H H H H H H H H H H H H H
charge: -0.095626 -0.112065 -0.111004 -0.499471 -0.499559 -0.634812 -0.636483 0.332648 -0.575427 -0.585974 -0.071235 0.194399 0.194571 0.374864 0.375110 -0.384060 -0.384419 -0.446742 -0.446922 -0.422880 -0.422952 -0.246217 -0.246144 -0.237793 -0.237819 0.292317 0.292282 0.278506 0.275295 0.275325 0.278528 0.294350 0.242538 0.242424 0.294519 0.262565 0.287162 0.262593 0.262313 0.283941 0.262041 0.244546 0.244511 0.227683 0.227585 0.255264 0.255302 0.245101 0.245094 0.247109 0.247118
chargesum: 1.00000
title: Mulliken charges with hydrogens summed into heavy atoms:
elementType: N C C C C C C C C C C C C C C C C C C C C C C C C
charge: -0.095626 0.180252 0.181278 0.054330 0.054294 -0.097925 -0.099540 0.332648 0.236894 0.222321 -0.071235 0.194399 0.194571 0.374864 0.375110 -0.139515 -0.139908 -0.219059 -0.219337 -0.167616 -0.167650 -0.001116 -0.001050 0.009315 0.009300
polarizability: 2.52026925e+02 1.68152238e-02 3.13382119e+02 -2.36744705e+01 1.23045935e-02 2.21665029e+02
1716.lowfreq: -14.6709 -13.0800 -0.0002 0.0003 0.0008 6.5288 19.6404 41.9795 57.7521
frequency: 17.5950 41.3871 57.7485 59.0946 81.8629 107.6641 116.7661 163.8867 170.8159 178.5256 203.7151 230.6997 256.9801 275.5008 305.7969 313.7985 316.9833 337.8895 383.2269 385.2991 405.3573 406.5286 416.5044 444.3711 454.1794 470.5514 475.6198 502.9186 508.5346 534.0542 545.3181 574.9125 586.1753 624.3105 642.7173 663.4780 674.4737 694.4848 706.7274 727.3446 746.5489 747.9514 779.7767 781.1781 793.0503 813.7771 815.8667 842.4385 852.9851 855.9906 881.3913 884.6596 890.4565 895.3821 905.6274 908.2946 926.2746 961.2678 963.8573 978.1110 989.8623 990.4811 997.2306 999.6823 1007.6754 1009.0509 1038.5093 1042.7492 1048.4719 1084.2026 1092.1924 1097.2551 1114.7512 1129.6458 1143.1181 1154.2613 1163.9823 1179.2101 1180.0256 1181.6786 1184.6150 1201.4418 1216.2616 1224.5958 1224.6568 1240.2406 1247.7565 1253.0667 1255.6855 1268.5480 1290.6262 1293.9852 1302.2515 1315.7179 1322.1087 1324.8443 1339.5642 1343.7842 1371.4151 1379.1416 1409.0581 1416.1585 1421.4166 1445.8360 1452.5640 1454.1571 1455.4958 1472.5256 1474.0371 1474.9986 1484.5224 1484.5913 1489.8514 1501.9638 1512.3042 1557.0072 1566.0481 1599.1961 1601.9505 1626.1438 1637.1173 2980.7984 2983.1941 3029.6325 3031.8879 3033.2151 3039.6632 3052.7953 3055.8483 3057.5030 3062.3491 3091.6299 3093.7175 3108.9289 3118.6843 3125.7764 3126.7687 3128.3336 3132.6781 3133.1562 3135.1991 3150.6446 3150.8523 3170.5590 3170.7887 3174.1798 3184.9949
redmass: 3.9794 3.5689 4.8575 4.0385 4.1444 2.4843 1.7207 3.7278 1.8063 4.7022 1.5513 2.5063 3.5966 2.0431 3.2727 4.0499 3.5527 3.6162 3.6968 3.4010 3.3773 2.5059 1.8838 2.9759 2.2040 4.1616 2.9182 4.3681 3.6493 4.4026 4.3385 3.7432 3.1973 6.2106 4.1736 3.8342 5.6844 4.9744 5.2973 2.0493 2.5906 2.1487 1.5781 2.2132 1.8182 1.5676 2.8410 3.4203 2.7090 2.6092 1.7584 3.0610 1.6918 1.6174 3.0133 3.8845 3.6220 1.3904 1.3897 2.1859 1.3206 2.2979 1.3412 1.3335 1.9660 2.0677 2.4922 1.9289 1.6910 2.2468 1.2681 2.4586 1.8516 1.1916 1.5185 1.3206 1.9638 1.1425 1.0670 1.5071 1.2964 1.6126 2.7225 1.5583 2.0326 1.3677 1.4624 1.5727 1.5971 1.7130 1.4444 1.4555 1.6602 1.7387 1.4390 1.7329 1.7382 1.3955 10.6002 5.2173 1.5978 1.1349 2.0427 1.1586 1.2616 1.6783 1.0578 1.0645 1.4531 1.5040 1.6299 1.5259 1.0637 1.0863 1.0538 6.6297 6.5760 5.9359 6.0882 7.0411 9.3658 1.0676 1.0678 1.0354 1.0636 1.0361 1.0660 1.0888 1.0935 1.0897 1.0884 1.1030 1.0844 1.1043 1.0946 1.0878 1.0877 1.1045 1.0893 1.0893 1.1043 1.0932 1.0933 1.1005 1.1005 1.1012 1.0997
irintensity: 0.5923 0.0123 0.0223 0.7660 0.3395 0.2403 0.5215 1.2426 0.0641 6.8807 0.0378 0.3726 4.0436 0.0319 1.4858 5.6608 0.0330 3.1332 1.5295 1.7997 0.3554 0.1087 0.0891 4.9173 3.0277 5.8695 8.3057 0.6027 0.1389 0.1545 1.0929 3.8024 0.0005 4.6640 3.4247 1.3460 2.9324 1.7136 0.4309 0.6968 1.6274 43.5956 26.4566 25.8807 6.7350 99.2177 0.0245 6.5000 5.5912 10.6286 0.3755 28.1787 4.0775 2.0899 32.9429 6.6963 0.6770 0.0096 8.7609 11.4388 2.3620 3.3593 0.0594 0.9978 0.5067 16.5374 3.6106 0.2491 5.1573 1.2397 0.5619 8.8310 3.3701 6.2954 10.9481 3.8249 5.7900 0.5039 0.0044 4.5987 0.8925 14.3384 2.5353 12.5935 3.5307 0.4759 3.0304 2.6402 12.5105 1.1619 6.5937 0.0009 16.4421 0.0036 3.9739 11.5614 0.0686 0.8874 2.4743 4.1575 1.6884 8.8425 9.8669 32.9356 2.5474 6.3884 6.7023 52.7650 7.6421 12.8303 24.6091 26.2174 0.7754 20.1900 6.5498 1.7409 0.0032 2.8516 2.0583 2.5691 4.5395 9.6973 40.6038 2.8072 5.2644 11.5405 17.9897 12.2001 4.8052 7.3336 35.1778 0.0042 0.0005 19.6135 19.5144 0.4057 13.0478 0.5536 0.1933 4.5259 5.5502 1.7387 23.9271 31.8375 7.4307 3.5606 4.0943
temp: 298.150 k
press: 1.00000 atm
elementType: 7 6 6 6 6 6 6 6 6 6 6 6 6 6 6 6 6 6 6 6 6 6 6 6 6 1 1 1 1 1 1 1 1 1 1 1 1 1 1 1 1 1 1 1 1 1 1 1 1 1 1
symmnumber: 1
zpe: 1145985.1 jmol-1
zpe.correction: 0.436483 hartree
zpe.thermalcorrener: 0.457115 hartree
zpe.thermalcorrenthalpy: 0.458059 hartree
zpe.thermalcorrgfe: 0.387455 hartree
zpe.sumelectzpe: -982.879627 hartree
zpe.sumelectthermal: -982.858994 hartree
zpe.sumelectthermalent: -982.858050 hartree
zpe.sumelectthermalfe: -982.928654 hartree
dipole: 12.2275 -0.0058 0.2511
dipole: 12.2301
quadrupole: -78.3083 -119.4180 -127.0207
quadrupole: -0.0235 -6.2135 0.0099
quadrupole: 29.9407 -11.1690 -18.7717 -0.0235 -6.2135 0.0099
hfenergy: -983.3161092 hartree
pointgroup: C01 [X(C24H26N1)]
dipole: -4.8100884 0.0898589 0.0858736 debye
polarizability: 251.9027003|0.6625717|313.3393206|23.7821866|1.457429|221.8320524 unknown
InChI: InChI=1S/C24H26N/c1-25(2)20-13-14-21(25)16-19(15-20)24-22-9-5-3-7-17(22)11-12-18-8-4-6-10-23(18)24/h3-12,20-21H,13-16H2,1-2H3
charge 1 multiplicity 1
51 atoms
N  -3.845733 0.073779 -0.116681
C  -2.891712 1.241638 0.319048
C  -2.938747 -1.151609 0.257202
C  -2.433807 0.783476 1.730125
C  -2.46399 -0.784253 1.689394
C  -1.693472 1.331888 -0.657871
C  -1.743503 -1.237892 -0.723511
C  -0.891795 0.030463 -0.676944
C  -5.119931 0.077403 0.721787
C  -4.276245 0.121087 -1.572604
C  0.475138 0.000708 -0.531612
C  1.289387 1.25336 -0.426324
C  1.241782 -1.285026 -0.481794
C  2.03136 1.540253 0.766616
C  1.968828 -1.650687 0.698739
C  1.300086 2.188072 -1.494843
C  1.220747 -2.172641 -1.589644
C  2.161614 0.605373 1.892463
C  2.133735 -0.770035 1.863333
C  2.693862 2.800172 0.866689
C  2.582498 -2.937993 0.74592
C  1.999944 3.408416 -1.393301
C  1.873437 -3.422001 -1.539253
C  2.688388 3.72184 -0.196192
C  2.545304 -3.812529 -0.355452
H  -3.485109 2.172485 0.315763
H  -3.568015 -2.057174 0.206745
H  -3.083603 1.187442 2.523931
H  -1.41455 1.154465 1.92022
H  -1.459558 -1.20313 1.858125
H  -3.128632 -1.203495 2.462711
H  -1.059578 2.165264 -0.308249
H  -2.03742 1.63146 -1.667595
H  -2.096778 -1.472358 -1.747201
H  -1.142596 -2.111739 -0.417024
H  -5.723121 -0.804433 0.454555
H  -4.875625 0.043897 1.789722
H  -5.686199 0.996126 0.502077
H  -4.858734 1.041304 -1.737884
H  -3.410127 0.114312 -2.241563
H  -4.906945 -0.757296 -1.782509
H  0.76182 1.94294 -2.417936
H  0.695626 -1.867738 -2.502467
H  2.435087 1.069067 2.850414
H  2.387266 -1.28439 2.800714
H  3.244714 3.034107 1.785155
H  3.121342 -3.231505 1.654315
H  2.004413 4.11084 -2.233138
H  1.854131 -4.087431 -2.408508
H  3.224301 4.671701 -0.101008
H  3.044119 -4.785486 -0.30025
