program: Gaussian 09
title: 000213998
version: EM64L-G09RevD.01
frameworkgroup: C1[X(C12H20N2O5)]
method: RPBEPBE
basis: SDD
operation: Freq
keyword: #p
keyword: freq=noraman
keyword: PBEPBE/SDD
title: #p freq=noraman PBEPBE/SDD
converged: YES YES NO NO
title: Mulliken charges:
elementType: O O O O O N N C C C C C C C C C C C C H H H H H H H H H H H H H H H H H H H H
charge: -0.207528 -0.225803 -0.226376 -0.229977 -0.232542 -0.208016 -0.211804 0.088011 -0.408692 -0.398051 0.192848 0.175984 0.227820 -0.723881 -0.705484 -0.281361 -0.282109 -0.506852 -0.500782 0.228772 0.237803 0.250545 0.212692 0.242630 0.217812 0.223235 0.230644 0.248106 0.220646 0.240735 0.256375 0.236131 0.259551 0.225142 0.235401 0.222168 0.224520 0.235240 0.216444
chargesum: 0.00000
title: Mulliken charges with hydrogens summed into heavy atoms:
elementType: O O O O O N N C C C C C C C C C C C C
charge: -0.207528 -0.225803 -0.226376 -0.229977 -0.232542 -0.208016 -0.211804 0.088011 0.057884 0.065186 0.192848 0.175984 0.227820 -0.040205 -0.006087 0.215749 0.213572 0.175859 0.175423
polarizability: 1.75448080e+02 3.95501348e+00 1.60528173e+02 -4.65132176e+00 -1.94481853e+00 1.36352132e+02
1716.lowfreq: -11.0078 -0.0005 -0.0002 0.0005 3.7840 6.8523 24.8529 36.5215 39.0183
frequency: 24.5991 36.3382 38.9510 62.1638 68.9409 79.2074 99.9362 111.5309 112.9349 149.1654 157.2135 171.2048 178.8443 186.3604 200.7436 205.7636 217.3100 256.7941 269.4914 285.7922 306.1583 328.4248 351.9811 370.4628 396.0220 420.6865 435.3122 444.7420 460.2803 487.0330 570.5884 586.9444 649.6888 689.3353 698.3413 717.1048 736.7966 779.6289 784.8483 833.6626 850.7670 852.1702 878.4894 927.3725 943.6338 954.3020 1016.4388 1024.9382 1037.5014 1049.4234 1058.0264 1060.6945 1079.1306 1095.2915 1110.7850 1111.5571 1135.2171 1141.4947 1169.6603 1181.3687 1200.3522 1212.8854 1266.9711 1283.9495 1289.7374 1312.1549 1329.6483 1334.1201 1340.3553 1353.5361 1391.5372 1400.4471 1403.4884 1407.8162 1429.0064 1429.7358 1439.9294 1442.8064 1449.5042 1452.1398 1455.6351 1467.8723 1471.2157 1474.3484 1475.2404 1480.7731 1485.6154 1489.7875 1589.1374 1597.5274 1652.6159 2961.5883 2962.1282 2979.8982 2983.5294 2995.4964 3022.7177 3027.6184 3031.7258 3042.7994 3049.5912 3050.3015 3069.8435 3081.7539 3084.8745 3098.1932 3102.1793 3118.2220 3118.5908 3139.6070 3143.0457
redmass: 4.2304 3.7887 4.4925 4.1222 4.0824 2.1515 2.6579 2.2379 2.6932 2.5924 3.2582 3.3496 2.2988 1.8774 1.2431 2.1358 1.8760 1.5623 3.5802 2.8489 2.5302 3.4745 5.7655 5.9574 5.3892 2.9703 4.0686 2.8225 3.7908 3.5396 6.5337 6.7017 7.7833 3.1979 6.8187 4.2921 9.2927 1.3639 1.6178 3.0399 5.5028 5.4249 3.9215 3.0296 1.9721 2.6063 2.8147 2.2368 2.8943 3.5679 2.0602 4.3636 1.7934 2.9862 1.2942 1.2915 1.8577 1.7071 3.2492 2.3980 2.4778 2.4465 1.5534 1.5429 2.2024 1.4674 1.3931 1.3634 1.4642 1.6980 1.2108 1.2217 1.1999 1.2808 1.0920 1.1050 1.1076 1.1138 1.0848 1.0716 1.0714 1.0818 1.0515 1.0495 1.0467 1.0481 1.0445 1.0525 9.9411 10.8829 9.6927 1.0326 1.0324 1.0599 1.0362 1.0370 1.0608 1.0634 1.0635 1.1012 1.1028 1.1027 1.0989 1.0990 1.0987 1.1027 1.1006 1.1010 1.1009 1.1021 1.1022
irintensity: 0.4932 1.8004 0.5320 0.6944 1.9447 0.8275 3.5686 0.0698 5.1338 4.3620 6.0259 1.4599 1.3821 3.5053 1.7367 2.6880 2.7833 0.9348 3.8782 4.1672 2.3469 5.1009 22.3945 6.7219 8.6470 10.8293 13.2516 11.0288 0.5149 11.7266 55.2367 7.8305 20.4044 2.3572 2.1961 8.6607 20.4895 8.6226 8.8646 1.8666 23.5901 32.1676 49.6489 2.0824 20.3559 31.5021 92.8408 32.6440 12.9636 53.3400 11.2287 158.7406 14.8035 8.9085 1.1290 3.1824 29.0197 33.2132 40.2936 27.5000 21.1227 13.3548 117.6981 86.5324 208.5363 28.5958 0.1090 0.4551 103.8687 107.3704 13.0149 35.5374 35.7965 46.9478 21.0076 24.5586 41.0589 37.7447 30.3076 12.9760 8.6781 6.9239 6.3015 21.6348 8.1610 7.8258 16.5030 11.1973 284.7087 417.8569 11.6463 38.3039 36.8260 22.8869 21.0599 22.8370 15.6477 30.7077 32.6296 7.6797 67.0623 30.6551 11.5540 36.2175 20.3125 28.6139 26.3860 22.2639 36.9999 0.9606 0.7235
temp: 298.150 k
press: 1.00000 atm
elementType: 8 8 8 8 8 7 7 6 6 6 6 6 6 6 6 6 6 6 6 1 1 1 1 1 1 1 1 1 1 1 1 1 1 1 1 1 1 1 1
symmnumber: 1
zpe: 834474.2 jmol-1
zpe.correction: 0.317834 hartree
zpe.thermalcorrener: 0.339115 hartree
zpe.thermalcorrenthalpy: 0.340059 hartree
zpe.thermalcorrgfe: 0.266849 hartree
zpe.sumelectzpe: -953.405730 hartree
zpe.sumelectthermal: -953.384450 hartree
zpe.sumelectthermalent: -953.383505 hartree
zpe.sumelectthermalfe: -953.456716 hartree
dipole: -1.8023 0.9503 -0.7166
dipole: 2.1599
quadrupole: -114.4412 -124.6938 -109.3529
quadrupole: 2.0614 4.4964 8.2996
quadrupole: 1.7214 -8.5312 6.8098 2.0614 4.4964 8.2996
hfenergy: -953.7235642 hartree
pointgroup: C01 [X(C12H20N2O5)]
dipole: 0.7997455 -0.0471295 0.2833448 debye
polarizability: 167.4818124|-8.6135421|168.9169318|-2.3404771|1.7391158|135.9296409 unknown
InChI: InChI=1S/C12H20N2O5/c1-5-12(6-2)9(15)13(7-18-3)11(17)14(8-19-4)10(12)16/h5-8H2,1-4H3
charge 0 multiplicity 1
39 atoms
O  -1.468051 -2.463386 -0.06444
O  2.511609 0.205246 -0.166771
O  -3.658327 0.036975 -0.409099
O  0.826359 3.289894 -0.245106
O  -1.448144 1.873212 1.650962
N  -1.488141 -0.264514 0.69621
N  0.535701 1.05349 0.721928
C  0.716202 -1.410104 0.227519
C  1.243554 -2.239641 -0.978868
C  1.126627 -2.092692 1.607407
C  -0.820467 -1.428626 0.233639
C  1.327393 -0.006808 0.209755
C  -0.837611 0.939031 1.073207
C  0.7959 -1.702392 -2.354438
C  2.637837 -2.313235 1.813473
C  -2.980227 -0.309684 0.816176
C  1.144376 2.413588 0.857689
C  -3.6141 1.469926 -0.747674
C  1.525615 2.972861 -1.501511
H  0.883824 -3.276136 -0.849472
H  2.345347 -2.244435 -0.929009
H  0.59615 -3.063391 1.634341
H  0.724652 -1.480626 2.439891
H  -0.303859 -1.711019 -2.455956
H  1.164016 -0.673534 -2.524667
H  1.207795 -2.335529 -3.160303
H  3.048351 -3.037637 1.089884
H  3.212116 -1.376198 1.716064
H  2.811539 -2.719862 2.826496
H  -3.255571 0.366581 1.645753
H  -3.25609 -1.354679 1.011555
H  2.233665 2.259623 0.961217
H  0.697568 2.891419 1.739537
H  -3.916382 2.095391 0.114409
H  -4.324491 1.596172 -1.578604
H  -2.602944 1.780483 -1.075741
H  2.614172 2.859419 -1.337052
H  1.326095 3.823764 -2.170481
H  1.136442 2.042252 -1.959021
