program: Gaussian 09
title: 000213974
version: EM64L-G09RevD.01
frameworkgroup: C1[X(C13H17NO2)]
method: RPBEPBE
basis: SDD
operation: Freq
keyword: #p
keyword: freq=noraman
keyword: PBEPBE/SDD
title: #p freq=noraman PBEPBE/SDD
converged: YES YES NO NO
title: Mulliken charges:
elementType: O O N C C C C C C C C C C C C C H H H H H H H H H H H H H H H H H
charge: -0.341167 -0.265203 -0.373788 0.330149 -0.561081 -0.601259 0.147417 0.328684 -0.734103 -0.762923 0.227124 -0.458483 -0.394644 -0.207342 0.282614 -0.604344 0.217370 0.261078 0.226460 0.219356 0.233968 0.208030 0.207815 0.210041 0.211434 0.217278 0.241927 0.246776 0.225257 0.331306 0.271309 0.230482 0.228461
chargesum: 0.00000
title: Mulliken charges with hydrogens summed into heavy atoms:
elementType: O O N C C C C C C C C C C C C C
charge: -0.341167 -0.265203 -0.042482 0.330149 -0.082633 -0.155443 0.147417 0.328684 -0.084290 -0.124169 0.227124 -0.216556 -0.147868 0.017915 0.282614 0.125909
polarizability: 1.82291176e+02 7.35596392e+00 1.66492135e+02 -1.33884137e+01 1.82081177e+00 1.04037226e+02
1716.lowfreq: -12.4939 -5.5838 -0.0007 -0.0005 -0.0003 2.9727 38.5874 54.3913 71.2163
frequency: 38.5721 54.3661 71.1242 77.7897 95.1646 127.5493 151.4165 199.7693 218.4736 223.8085 240.3222 258.9353 278.6424 298.4821 318.6966 345.9241 383.7698 393.8131 466.7877 495.2020 507.0589 528.8123 576.4561 582.9727 613.2695 660.1707 688.6810 706.6924 719.4359 769.9071 787.8703 824.4148 870.1225 887.6909 900.4037 907.2887 922.2056 934.6937 963.8823 970.0889 973.2996 1015.0696 1054.9767 1082.9703 1096.6820 1126.7146 1130.1968 1146.6536 1160.1753 1170.7775 1182.4366 1195.3316 1208.0068 1232.1673 1241.3252 1274.3523 1278.2944 1302.1637 1373.1508 1387.8058 1395.4733 1430.8020 1448.9840 1451.1598 1454.2624 1461.5583 1463.8701 1465.3492 1476.4640 1481.3312 1483.9582 1484.4455 1514.2308 1592.0544 1621.4377 1697.3017 2964.6215 2965.5297 2970.0338 2979.2637 2983.5311 3031.5480 3035.3480 3056.6229 3058.9101 3065.2858 3065.9998 3070.0077 3112.5697 3127.3524 3146.7233 3168.3763 3577.0721
redmass: 3.8197 3.6923 3.2244 2.7244 1.3586 3.7261 3.2009 2.6518 2.2708 1.3892 2.6689 1.5047 4.2107 2.1508 2.2310 4.3451 2.6178 2.0393 3.1288 3.1162 4.0608 4.4620 3.0042 1.3554 5.7536 5.4150 9.8521 2.9336 3.6633 3.8682 1.5143 4.5201 4.2149 1.5913 2.0883 1.8168 1.6144 1.3705 1.5184 3.0170 1.6619 1.4313 2.0273 5.1554 1.3710 1.2836 1.3204 1.6668 1.5950 1.8017 1.9521 1.8544 1.9286 2.3422 2.4304 1.9978 1.8816 2.3782 1.2145 2.3015 1.7798 1.1604 1.9102 1.3798 1.2940 1.5953 1.5685 1.0589 1.1338 1.0569 1.0463 1.0554 1.3885 7.1010 8.4765 9.4420 1.0568 1.0364 1.0409 1.0355 1.0598 1.0986 1.1016 1.1025 1.0994 1.0997 1.0989 1.0993 1.0981 1.0869 1.0927 1.0978 1.0772
irintensity: 3.8126 2.9202 0.8593 2.1188 0.8048 3.5530 2.2924 0.7149 1.9206 0.5846 3.5694 1.4555 4.2290 0.2748 1.4945 17.2109 1.8756 0.5405 1.1876 0.6964 0.7946 0.9041 35.5292 95.7749 0.2429 3.3325 18.3683 11.8323 6.3181 1.9306 51.4369 6.5169 32.6754 3.8360 4.1250 1.5123 3.7312 1.3103 3.3367 31.6728 7.4226 0.6538 5.8166 271.3556 4.9759 1.6807 64.4897 51.9249 93.9709 29.8698 137.7829 120.4920 5.1483 0.8904 3.4645 7.6221 15.9608 19.4330 23.3927 1.2790 15.1328 28.8035 121.9186 7.1526 74.1542 30.4996 15.8642 2.9153 6.3341 6.6173 14.7119 13.1441 142.8158 12.8563 5.5085 279.2839 22.0659 44.2453 41.7045 86.1545 19.6915 16.4755 12.8439 36.0292 4.6768 35.8113 61.2252 56.5049 4.2032 4.9531 22.3804 16.9707 42.0795
temp: 298.150 k
press: 1.00000 atm
elementType: 8 8 7 6 6 6 6 6 6 6 6 6 6 6 6 6 1 1 1 1 1 1 1 1 1 1 1 1 1 1 1 1 1
symmnumber: 1
zpe: 717728.0 jmol-1
zpe.correction: 0.273368 hartree
zpe.thermalcorrener: 0.289369 hartree
zpe.thermalcorrenthalpy: 0.290313 hartree
zpe.thermalcorrgfe: 0.229889 hartree
zpe.sumelectzpe: -709.608668 hartree
zpe.sumelectthermal: -709.592668 hartree
zpe.sumelectthermalent: -709.591724 hartree
zpe.sumelectthermalfe: -709.652147 hartree
dipole: -1.2844 -0.7665 1.8744
dipole: 2.3980
quadrupole: -74.6896 -89.7348 -100.2557
quadrupole: 3.4866 -7.8438 -1.4800
quadrupole: 13.5371 -1.5081 -12.0290 3.4866 -7.8438 -1.4800
hfenergy: -709.8820365 hartree
pointgroup: C01 [X(C13H17N1O2)]
dipole: 0.452676 0.4506805 0.6943274 debye
polarizability: 180.0331362|11.0116945|164.4400051|16.189022|-12.0106476|108.3473949 unknown
InChI: InChI=1S/C13H17NO2/c1-13(2)7-9-5-4-6-11(10(9)8-13)16-12(15)14-3/h4-6,14H,7-8H2,1-3H3
charge 0 multiplicity 1
33 atoms
O  1.800003 -0.440483 0.895941
O  2.233643 0.450432 -1.270611
N  3.649939 0.820519 0.5735
C  -2.182169 1.475832 -0.320996
C  -0.63331 1.216812 -0.248698
C  -2.756715 0.088201 -0.785495
C  -0.523142 -0.27059 0.029804
C  -1.748982 -0.925584 -0.263883
C  -2.720279 1.805744 1.096463
C  -2.536787 2.61495 -1.299947
C  0.557781 -1.034337 0.505014
C  -1.897617 -2.313206 -0.073212
C  0.428009 -2.425039 0.711662
C  -0.800678 -3.060405 0.423983
C  2.54509 0.308572 -0.065494
C  4.659325 1.612697 -0.132117
H  -0.140752 1.840748 0.521263
H  -0.141653 1.449816 -1.213685
H  -2.79957 0.04442 -1.893677
H  -3.783358 -0.086465 -0.412668
H  -2.475742 0.998259 1.81122
H  -2.277094 2.745331 1.477157
H  -3.819615 1.929557 1.081816
H  -3.63232 2.758399 -1.363888
H  -2.092153 3.573564 -0.971752
H  -2.160826 2.397948 -2.317345
H  -2.848143 -2.810089 -0.29766
H  1.284093 -2.988999 1.094711
H  -0.899247 -4.139108 0.587855
H  3.7598 0.600656 1.563561
H  4.322524 1.742309 -1.172873
H  5.640376 1.102048 -0.141108
H  4.778869 2.610291 0.329058
