program: Gaussian 09
title: 000213997
version: EM64L-G09RevD.01
frameworkgroup: C1[X(C20H24N2O7)]
method: RPBEPBE
basis: SDD
operation: Freq
keyword: #p
keyword: freq=noraman
keyword: PBEPBE/SDD
title: #p freq=noraman PBEPBE/SDD
converged: YES YES NO NO
title: Mulliken charges:
elementType: O O O O O O O N N C C C C C C C C C C C C C C C C C C C C H H H H H H H H H H H H H H H H H H H H H H H H
charge: -0.200860 -0.200666 -0.258657 -0.258591 -0.233134 -0.235167 -0.235131 -0.197551 -0.197301 -0.002632 -0.379034 0.141409 0.141175 0.408960 0.274173 -0.722252 -0.385215 -0.385182 -0.275368 -0.275518 -0.232812 -0.232852 -0.240469 0.319595 0.319946 -0.482464 -0.482580 -0.660143 -0.660132 0.235414 0.235312 0.235812 0.223390 0.236037 0.267497 0.267522 0.275808 0.264145 0.275712 0.264107 0.233577 0.233579 0.235390 0.245708 0.247188 0.245688 0.247237 0.225776 0.217010 0.236892 0.236861 0.216996 0.225795
chargesum: 0.00000
title: Mulliken charges with hydrogens summed into heavy atoms:
elementType: O O O O O O O N N C C C C C C C C C C C C C C C C C C C C
charge: -0.200860 -0.200666 -0.258657 -0.258591 -0.233134 -0.235167 -0.235131 -0.197551 -0.197301 -0.002632 0.091692 0.141409 0.141175 0.408960 0.274173 -0.027013 -0.117717 -0.117660 0.264585 0.264300 0.000765 0.000727 -0.005078 0.319595 0.319946 0.010432 0.010344 0.019535 0.019520
polarizability: 2.81544250e+02 4.47334377e-02 2.66895935e+02 -1.76572441e-02 -1.66650692e+01 1.98560136e+02
1716.lowfreq: -7.3988 -1.7280 0.0002 0.0006 0.0009 3.9086 14.8680 17.1967 19.6653
frequency: 14.5721 16.9078 19.6275 21.1652 30.1164 31.6710 34.4353 37.7567 45.2879 55.3382 74.6483 92.0062 103.6511 118.3429 143.8824 145.2296 161.2721 170.1820 181.9348 182.7579 197.9833 206.2481 213.2202 214.8252 254.7181 261.0255 286.2313 304.9717 306.6383 323.0962 342.4693 342.8961 367.5314 384.4060 402.4518 440.2322 446.3706 452.6818 485.9138 523.6050 524.4244 524.8122 539.7625 551.7860 598.8647 614.3943 631.0831 638.1507 672.3735 683.4547 701.8806 705.7632 724.3009 732.9841 766.1220 778.0710 791.4953 792.0008 804.0134 823.9506 859.4051 864.0308 904.6168 912.2637 920.1301 921.6469 939.4449 961.6573 986.9676 989.5122 1003.2940 1008.5489 1013.8852 1019.2567 1031.2394 1045.6357 1051.7628 1065.4773 1069.5039 1085.8248 1086.1855 1086.9261 1095.1803 1109.3776 1110.7640 1142.8497 1158.3399 1163.7355 1178.0302 1182.7621 1197.0613 1209.3558 1243.2643 1243.4036 1278.0180 1287.5023 1299.2486 1325.6227 1330.2953 1332.7501 1335.5089 1343.9763 1353.9047 1376.3938 1386.9505 1387.8497 1395.1827 1400.7247 1400.8169 1435.7787 1442.1364 1442.7482 1449.4128 1452.4778 1454.8353 1473.1494 1473.1762 1481.4546 1482.3699 1482.3825 1484.2031 1485.3747 1588.5015 1599.5838 1604.0152 1607.7924 1660.9144 1666.5919 1669.0757 2991.5165 2996.3821 2996.4611 3000.7338 3000.7710 3025.3184 3050.5813 3050.6667 3063.4827 3063.8131 3076.7907 3085.0457 3097.3490 3097.4111 3101.6442 3105.6939 3105.7222 3130.0499 3137.7061 3145.6735 3145.9060 3149.2394 3156.5924 3169.3746
redmass: 4.6729 4.4843 3.8560 3.6960 2.4145 2.5723 3.0846 5.4669 8.2627 5.9580 4.3573 4.0989 6.3122 2.3455 5.0442 5.9290 3.4244 2.3890 5.3494 4.1622 1.3012 1.6440 4.5239 1.7635 4.4074 4.6471 3.5312 2.3112 3.8643 5.7866 2.6892 5.5263 3.3207 8.3807 2.8688 7.3054 4.6741 5.6692 4.5966 3.8028 4.2689 3.6368 3.3306 4.3368 6.1054 6.4246 6.1382 4.2550 5.4674 3.8357 7.4782 1.9657 4.2143 9.4833 1.6997 1.6414 1.4148 1.3594 3.3722 4.7966 1.2436 4.3807 5.2756 6.7021 2.9960 2.5943 1.9494 2.0533 1.3793 5.8394 1.3273 2.5692 2.1013 2.6965 2.5100 2.6417 2.8007 3.0271 2.8291 1.8727 1.6511 1.9540 1.6395 2.5500 2.6158 3.6870 3.6091 2.2726 1.1000 2.1788 3.4211 1.1320 1.1752 1.1755 2.3118 1.4239 1.4423 1.5897 1.4331 1.4386 1.6298 2.0700 3.2501 6.1472 1.3259 1.3599 1.2142 1.2097 1.2098 2.2459 1.0836 1.0834 1.0872 1.0977 1.0997 1.0395 1.0395 1.9846 1.0506 1.0521 1.0623 1.0426 6.2572 9.6886 6.8886 8.6357 9.6965 9.3782 9.6809 1.0356 1.0607 1.0608 1.0383 1.0382 1.0605 1.0967 1.0967 1.0575 1.0575 1.1014 1.0982 1.1005 1.1005 1.1029 1.1003 1.1003 1.0850 1.0879 1.1092 1.1092 1.0922 1.0959 1.1016
irintensity: 0.1826 0.2738 0.0328 0.0251 0.1079 1.6928 0.2160 0.3493 0.1033 3.8842 2.0112 0.6244 6.9388 0.0024 0.1001 0.3313 2.8973 0.0016 0.1418 4.4820 0.4260 2.1926 0.6900 0.1006 11.4434 0.1504 7.3643 1.7430 1.6045 4.5438 13.9710 30.5845 0.0044 15.0852 0.0103 14.0876 13.0214 26.7639 0.6493 15.9201 17.6780 8.6916 26.3490 10.1989 0.2146 0.0544 5.4129 10.5675 10.9712 7.0129 1.7891 41.1057 0.3308 9.9321 50.2723 11.7619 29.1741 0.1869 4.4612 52.9093 0.2617 3.8101 64.8648 116.0522 101.7204 9.1756 8.4229 16.8400 0.1149 3.4355 0.1139 313.3221 129.6205 79.2551 12.5194 13.3769 18.3779 129.7850 263.7191 0.6775 1.4212 4.9571 6.5431 238.1975 151.2716 0.3497 3.9588 0.0246 5.7134 68.5357 1.4414 6.0483 0.3712 0.5733 174.6587 51.9665 17.6025 65.1095 69.6787 22.1256 99.4137 97.9321 142.3381 0.0322 25.0845 49.2351 18.3354 23.8250 15.5550 13.2298 24.0676 37.4406 19.0528 63.5590 73.4606 1.2443 23.4858 36.5442 0.6267 24.7555 7.4003 16.2505 21.2025 143.8521 177.8349 300.4459 75.5997 281.8320 32.6119 25.7687 42.4741 4.1097 23.5555 18.1577 13.3671 2.7928 3.3219 9.3326 11.1252 0.9671 32.8331 16.5580 39.4000 20.8309 2.8443 52.0826 0.0890 4.6237 11.7814 5.2096 6.2531 14.2841 24.6100
temp: 298.150 k
press: 1.00000 atm
elementType: 8 8 8 8 8 8 8 7 7 6 6 6 6 6 6 6 6 6 6 6 6 6 6 6 6 6 6 6 6 1 1 1 1 1 1 1 1 1 1 1 1 1 1 1 1 1 1 1 1 1 1 1 1
symmnumber: 1
zpe: 1091676.0 jmol-1
zpe.correction: 0.415797 hartree
zpe.thermalcorrener: 0.445706 hartree
zpe.thermalcorrenthalpy: 0.446650 hartree
zpe.thermalcorrgfe: 0.348847 hartree
zpe.sumelectzpe: -1410.486198 hartree
zpe.sumelectthermal: -1410.456290 hartree
zpe.sumelectthermalent: -1410.455345 hartree
zpe.sumelectthermalfe: -1410.553148 hartree
dipole: 0.0081 -0.0620 0.8592
dipole: 0.8615
quadrupole: -191.1947 -143.1201 -172.2832
quadrupole: 0.1357 -0.0532 -10.4177
quadrupole: -22.3287 25.7459 -3.4172 0.1357 -0.0532 -10.4177
hfenergy: -1410.9019953 hartree
pointgroup: C01[X(C20H24N2O7)]
dipole: -0.0062358 0.0043546 -0.3388362 debye
polarizability: 264.9268418|0.2151802|281.5405554|20.2153879|-0.0106463|200.5329228 unknown
InChI: InChI=1S/C20H24N2O7/c1-4-15(23)28-12-21-17(25)20(6-3,14-10-8-7-9-11-14)18(26)22(19(21)27)13-29-16(24)5-2/h7-11H,4-6,12-13H2,1-3H3
charge 0 multiplicity 1
53 atoms
O  0.514032 -2.364156 -0.929071
O  0.560095 2.362273 -0.916643
O  -2.059071 -2.761301 0.748633
O  -1.996039 2.809275 0.768073
O  -1.168228 0.006323 2.709766
O  -1.391473 -4.99586 0.547501
O  -1.271077 5.026854 0.576739
N  -0.263143 -1.200814 0.919153
N  -0.237263 1.205088 0.926803
C  1.189888 -0.007774 -0.757228
C  1.372693 -0.0054 -2.307961
C  0.444585 -1.274301 -0.309449
C  0.469831 1.270817 -0.30254
C  2.606474 -0.023233 -0.081262
C  -0.583849 0.003602 1.600123
C  0.055279 0.006818 -3.110167
C  3.264562 -1.252802 0.179369
C  3.288387 1.192033 0.185194
C  -0.803233 -2.448093 1.468528
C  -0.748437 2.460558 1.485416
C  4.570437 -1.263931 0.717082
C  4.594241 1.175018 0.722781
C  5.239883 -0.051516 0.995813
C  -2.199849 -4.087545 0.271921
C  -2.10266 4.140983 0.297371
C  -3.450322 -4.192783 -0.581436
C  -3.350514 4.282603 -0.554468
C  -3.812576 -5.647327 -0.929825
C  -3.673646 5.74749 -0.897868
H  1.978149 0.882593 -2.560602
H  1.963947 -0.901697 -2.56496
H  -0.540578 0.911004 -2.894153
H  0.278125 0.006799 -4.192022
H  -0.554931 -0.888359 -2.896989
H  2.7730 -2.203866 -0.050612
H  2.815506 2.153705 -0.039864
H  -0.088549 -3.273135 1.320341
H  -1.048311 -2.280766 2.526049
H  -0.014334 3.269646 1.344073
H  -0.997815 2.290554 2.541509
H  5.063858 -2.222189 0.913139
H  5.10631 2.122492 0.923387
H  6.25207 -0.062374 1.414348
H  -4.273686 -3.679011 -0.051803
H  -3.268495 -3.600189 -1.499892
H  -4.186977 3.789576 -0.025626
H  -3.185589 3.688188 -1.474933
H  -4.032494 -6.231815 -0.019813
H  -4.701884 -5.673628 -1.583554
H  -2.978233 -6.146704 -1.450396
H  -2.826815 6.225611 -1.418231
H  -4.562883 5.799926 -1.550108
H  -3.876199 6.334939 0.014264
