program: Gaussian 09
title: 000213938
version: EM64L-G09RevD.01
frameworkgroup: C1[X(C16H25NO2)]
method: RPBEPBE
basis: SDD
operation: Freq
keyword: #p
keyword: freq=noraman
keyword: PBEPBE/SDD
title: #p freq=noraman PBEPBE/SDD
converged: YES YES NO NO
title: Mulliken charges:
elementType: O O N C C C C C C C C C C C C C C C C H H H H H H H H H H H H H H H H H H H H H H H H H
charge: -0.315715 -0.449419 -0.345292 -0.248882 -0.512133 -0.492254 0.320369 0.244617 -0.395969 0.268691 -0.137736 -0.427891 -0.364926 -0.307758 -0.255998 -0.240487 -0.693647 -0.686461 -0.725317 0.239216 0.227493 0.233494 0.238957 0.233524 0.232951 0.212125 0.230676 0.227971 0.236157 0.227597 0.241933 0.250812 0.224734 0.226227 0.210404 0.205258 0.217916 0.226363 0.204293 0.230946 0.210571 0.201594 0.224316 0.350679
chargesum: 0.00000
title: Mulliken charges with hydrogens summed into heavy atoms:
elementType: O O N C C C C C C C C C C C C C C C C
charge: -0.315715 -0.098739 -0.103359 -0.009666 -0.051146 -0.019772 0.320369 0.244617 -0.163018 0.268691 0.074390 0.030757 -0.114114 0.155996 -0.031264 -0.016170 -0.051758 -0.037890 -0.082207
polarizability: 2.06699669e+02 -6.07075546e+00 1.84335233e+02 2.07889611e+01 1.47221101e+01 1.63936133e+02
1716.lowfreq: -16.1085 -7.2792 -0.0003 -0.0003 0.0002 6.1247 9.9168 20.7443 25.8522
frequency: -10.6585 20.5127 25.7724 29.9854 53.3536 84.5288 92.7751 116.2805 131.4015 154.7720 171.5037 192.5116 221.8771 226.6032 232.1672 244.9617 256.0037 296.7389 327.0115 333.3824 344.6779 368.3628 403.4612 430.3994 433.9847 444.5309 469.1906 484.2272 502.5448 524.8068 552.8042 573.4649 630.7375 655.0214 717.6745 737.0082 739.8687 756.5659 791.3212 804.7535 822.8153 845.2371 851.1142 879.1506 880.7211 901.8964 907.1407 921.6373 923.9896 935.8268 940.5949 953.2692 973.8101 996.4599 1018.1135 1026.8936 1033.0192 1039.5691 1061.0842 1072.3941 1076.4959 1096.3646 1100.7097 1102.8641 1113.5232 1167.5472 1171.4355 1175.1562 1176.5151 1202.6376 1209.3659 1224.0486 1238.2689 1241.3449 1245.6710 1274.5795 1289.6217 1327.0656 1347.3365 1358.7634 1364.2510 1370.2175 1371.8460 1377.6122 1389.1532 1394.8786 1434.6374 1442.0318 1443.8073 1451.6963 1454.0830 1461.1310 1462.1370 1467.7321 1474.5668 1483.7847 1485.0938 1492.8461 1495.1425 1590.3032 1607.8471 2934.4389 2966.1853 2970.5542 2980.6351 2982.7022 3030.4500 3055.7268 3060.5197 3061.8648 3066.9949 3067.5067 3076.7784 3085.5132 3091.8897 3092.6886 3097.9435 3107.2595 3128.4315 3139.4343 3157.5319 3170.3213 3192.0826 3210.5280 3415.9901 3529.3062
redmass: 3.4993 4.1011 3.4133 2.8612 3.5607 3.3455 3.2545 3.5613 3.8069 1.2431 3.6059 2.5962 2.0268 1.9511 1.2852 2.0568 1.8119 3.1043 4.0571 2.3648 3.2487 2.3808 1.9976 1.5796 1.9890 2.7144 2.6510 3.1350 3.1596 3.3393 4.2181 3.5316 3.3218 1.7426 3.7334 2.3657 3.0963 1.4159 1.2574 2.8361 1.3902 2.7989 1.6765 3.3257 2.0427 1.8745 3.2793 1.8925 1.9822 1.4307 1.2168 3.5782 1.3135 1.7705 1.3961 1.5250 2.1471 1.2168 1.4821 1.4094 1.9803 1.4096 2.1860 2.4137 1.9681 1.4080 1.3768 1.2685 1.4262 2.2723 2.4547 1.4890 1.6834 2.7074 1.4314 2.1380 1.4044 1.3207 1.3656 1.6024 1.7348 1.2225 1.2726 1.3690 4.3350 1.2091 2.1610 1.0945 1.1530 1.0778 1.1633 1.0499 1.0545 1.2878 1.0631 1.1036 1.0913 1.6918 1.3499 6.8946 6.5784 1.0691 1.0354 1.0366 1.0555 1.0357 1.0852 1.1077 1.0983 1.0934 1.0994 1.0979 1.0977 1.1004 1.0985 1.0549 1.0770 1.0701 1.0848 1.0902 1.0943 1.0986 1.1171 1.1150 1.0738 1.0651
irintensity: 0.1746 0.1025 0.0772 0.0556 0.0494 0.2160 1.8890 0.3970 2.2134 2.3969 3.6945 2.3668 1.1091 0.3328 0.7156 1.6472 2.9963 1.8130 1.0923 0.7116 0.9314 0.9692 10.5814 103.8638 34.4238 13.4901 5.2067 9.5938 13.8576 2.4857 7.5530 2.2366 15.4421 58.7551 3.9018 3.6400 1.1395 84.9786 6.9048 3.1553 21.0036 18.1819 3.5272 11.0946 2.5591 4.2599 6.6442 8.3314 12.9140 7.7734 0.0548 50.4026 0.2534 25.7459 1.5122 38.1985 20.3399 20.2409 19.8784 4.1306 27.1748 14.9410 17.4076 44.9940 15.6577 3.3476 8.8213 43.9711 0.9634 138.8241 46.6810 8.7873 55.3015 76.4671 11.9888 7.4220 1.0677 3.3299 4.2692 6.7950 1.7595 21.5439 27.9957 46.6365 2.3112 15.3482 73.2681 3.7598 19.0523 4.4897 38.5945 1.0101 2.7155 2.8957 7.9516 2.4055 11.9549 52.6844 27.5379 11.6854 24.7430 58.1260 32.0179 43.7855 28.8238 11.2290 29.4737 18.7602 3.6618 12.8105 20.6569 73.2159 70.2401 5.7380 59.1369 32.0988 13.6131 11.5866 0.2512 17.2741 33.9070 13.5824 0.0499 30.1096 2.4515 13.3948
temp: 298.150 k
press: 1.00000 atm
elementType: 8 8 7 6 6 6 6 6 6 6 6 6 6 6 6 6 6 6 6 1 1 1 1 1 1 1 1 1 1 1 1 1 1 1 1 1 1 1 1 1 1 1 1 1
symmnumber: 1
zpe: 992240.6 jmol-1
zpe.correction: 0.377924 hartree
zpe.thermalcorrener: 0.398025 hartree
zpe.thermalcorrenthalpy: 0.398969 hartree
zpe.thermalcorrgfe: 0.328199 hartree
zpe.sumelectzpe: -828.362484 hartree
zpe.sumelectthermal: -828.342383 hartree
zpe.sumelectthermalent: -828.341439 hartree
zpe.sumelectthermalfe: -828.412209 hartree
dipole: 1.0547 0.2362 -1.9162
dipole: 2.2000
quadrupole: -108.4555 -110.6157 -124.9064
quadrupole: -2.8105 -0.7347 4.9231
quadrupole: 6.2037 4.0435 -10.2472 -2.8105 -0.7347 4.9231
hfenergy: -828.7404081 hartree
pointgroup: C01 [X(C16H25N1O2)]
dipole: 0.4654525 0.3450435 0.6430349 debye
polarizability: 203.1542827|-6.6478523|191.5247417|-24.4126739|-3.4332886|160.2920112 unknown
InChI: InChI=1S/C16H25NO2/c1-16(2,3)17-10-13(18)11-19-15-7-5-4-6-14(15)12-8-9-12/h4-7,12-13,17-18H,8-11H2,1-3H3
charge 0 multiplicity 1
44 atoms
O  -0.50326 0.053343 -1.149567
O  0.888427 -0.988423 -3.304344
N  3.161883 0.50061 -0.680479
C  -2.065433 -1.80357 0.175578
C  -2.552582 -2.829162 1.204415
C  -1.060173 -2.468565 1.143707
C  -2.383928 -0.340912 0.280899
C  -1.567838 0.603381 -0.414253
C  -3.470355 0.159204 1.033687
C  3.649032 0.23822 0.71508
C  1.491073 0.062448 -2.470284
C  2.397496 -0.557857 -1.376994
C  -1.831778 1.990775 -0.348926
C  0.407699 0.96755 -1.871064
C  -3.745026 1.545543 1.1132
C  -2.922701 2.457956 0.420066
C  4.501205 -1.062757 0.811741
C  2.435831 0.147151 1.675106
C  4.518126 1.45815 1.107292
H  -1.992772 -2.166718 -0.857035
H  -3.116946 -2.476396 2.072488
H  -2.863138 -3.812288 0.839356
H  -0.358267 -3.201044 0.733729
H  -0.658759 -1.848724 1.951248
H  -4.118777 -0.552994 1.55569
H  2.105569 0.661387 -3.168045
H  3.028772 -1.331502 -1.867193
H  1.748251 -1.073901 -0.648241
H  0.874531 1.684488 -1.169463
H  -0.155084 1.495061 -2.66557
H  3.938166 0.84178 -1.266322
H  -1.2026 2.706372 -0.885576
H  -4.594874 1.904418 1.703242
H  3.915213 -1.945109 0.495148
H  4.841732 -1.238342 1.84931
H  5.396376 -0.994493 0.164253
H  1.790999 -0.720624 1.446097
H  1.819559 1.06011 1.597559
H  2.782621 0.039619 2.719098
H  3.924569 2.387499 1.0450
H  4.900648 1.350919 2.13783
H  5.390892 1.557405 0.431989
H  -3.125054 3.533669 0.469781
H  0.135872 -1.369378 -2.779532
