program: Gaussian 09
title: 000213913
version: EM64L-G09RevD.01
frameworkgroup: C1[X(C16H11Cl2NO)]
method: RPBEPBE
basis: SDD
operation: Freq
keyword: #p
keyword: freq=noraman
keyword: PBEPBE/SDD
title: #p freq=noraman PBEPBE/SDD
converged: YES YES NO NO
title: Mulliken charges:
elementType: Cl Cl O N C C C C C C C C C C C C C C C C H H H H H H H H H H H
charge: 0.010630 -0.038130 -0.203306 0.014750 -0.324423 -0.323869 -0.550074 0.298964 0.274720 0.032312 -0.380331 -0.398006 0.525273 -0.229661 -0.224051 -0.317052 -0.354525 -0.216141 -0.251524 -0.101949 0.260791 0.255380 0.250922 0.235397 0.253854 0.243133 0.231344 0.229377 0.251003 0.284049 0.261144
chargesum: 0.00000
title: Mulliken charges with hydrogens summed into heavy atoms:
elementType: Cl Cl O N C C C C C C C C C C C C C C C C
charge: 0.010630 -0.038130 -0.203306 0.014750 -0.063632 -0.068489 -0.063755 0.298964 0.274720 0.032312 -0.126478 -0.154873 0.525273 0.001683 0.005326 -0.317052 -0.103522 0.067908 0.009620 -0.101949
polarizability: 3.02845417e+02 3.53997742e+01 1.80544475e+02 4.23620602e-01 -2.27699060e+00 1.34096698e+02
1716.lowfreq: -5.9388 -4.5523 0.0025 0.0026 0.0027 4.4929 12.4410 28.9575 58.5112
frequency: 12.3403 28.9269 58.5062 94.0343 114.2351 139.6293 162.7603 177.8091 203.6758 222.0968 258.7740 286.3229 305.5298 355.4912 379.0074 403.2212 440.1891 444.1881 465.6686 493.2822 504.4847 535.6272 552.4775 579.7596 615.7053 638.5276 660.5511 701.4449 716.0607 721.3402 758.5741 765.2600 788.4208 807.8957 816.3718 841.5212 851.5196 870.8472 880.0974 881.6344 932.2701 945.2586 947.3401 970.8706 991.3048 1016.2727 1023.1039 1035.9346 1066.1201 1091.4445 1093.1966 1146.8052 1159.1547 1172.1732 1175.2735 1186.4920 1222.8115 1226.3217 1244.1854 1264.3485 1270.5092 1296.1677 1302.0318 1307.2499 1348.3733 1379.1847 1392.9776 1449.7083 1461.4204 1465.5531 1478.3972 1506.7064 1555.3326 1588.5853 1598.7362 1618.7015 2989.3577 3020.9156 3049.5724 3065.9333 3125.5195 3135.9627 3148.1825 3157.7559 3165.2018 3180.0719 3183.6651
redmass: 7.8127 8.2486 5.0579 5.7034 6.9126 6.9987 5.8157 10.3792 4.0769 8.5056 6.1087 6.5698 4.7725 7.3982 10.5100 3.6498 3.1645 3.6528 5.9467 5.0383 5.0745 5.5292 5.8250 4.8911 5.2151 5.8689 7.0637 5.0192 3.9484 2.7608 2.4471 3.0706 4.6646 3.6418 1.6853 4.4932 2.7254 1.3986 5.7591 1.6841 2.4066 1.7946 1.3645 2.2037 1.3282 3.2167 2.1799 2.5436 2.7811 2.5116 2.6266 1.3419 1.1809 1.0766 1.9555 1.5153 1.2885 1.5138 1.4491 1.3802 1.4689 2.2742 3.9609 1.4917 3.5520 6.2566 6.7922 2.4608 1.3380 2.3430 2.2223 9.1339 8.0587 6.9254 7.0076 7.0461 1.0641 1.0843 1.0993 1.0887 1.0861 1.0893 1.0951 1.0876 1.1005 1.0961 1.0941
irintensity: 0.1173 0.1674 0.1422 0.4672 3.4698 1.0342 0.0491 2.1933 1.9950 1.0716 3.1311 2.0899 1.5623 0.5701 6.1660 5.7385 4.8478 7.4624 12.3050 23.4601 15.7918 0.9588 4.3833 13.2652 2.0587 1.9956 3.3428 21.8795 4.8966 29.7477 25.3770 55.7481 29.6816 38.3676 37.7327 29.2726 12.6318 19.6095 57.9520 7.2447 1.2363 1.2032 1.2671 22.1919 0.1467 21.0212 2.6082 6.7692 14.3660 2.6736 47.2242 6.2125 6.3235 0.9094 4.1967 4.1773 3.4819 0.8806 3.1728 7.7785 5.6337 2.7194 49.8439 9.3906 21.1507 5.8784 2.8544 4.5430 1.0926 67.9943 7.7601 57.7689 33.4505 45.0177 0.6594 2.4186 16.5267 22.1366 11.2036 27.3941 1.2709 5.0003 22.9471 7.1234 30.3610 1.9321 1.7271
temp: 298.150 k
press: 1.00000 atm
elementType: 17 17 8 7 6 6 6 6 6 6 6 6 6 6 6 6 6 6 6 6 1 1 1 1 1 1 1 1 1 1 1
symmnumber: 1
zpe: 590274.9 jmol-1
zpe.correction: 0.224824 hartree
zpe.thermalcorrener: 0.240929 hartree
zpe.thermalcorrenthalpy: 0.241873 hartree
zpe.thermalcorrgfe: 0.178789 hartree
zpe.sumelectzpe: -1664.967863 hartree
zpe.sumelectthermal: -1664.951758 hartree
zpe.sumelectthermalent: -1664.950814 hartree
zpe.sumelectthermalfe: -1665.013898 hartree
dipole: 1.8419 -4.5990 1.2207
dipole: 5.1023
quadrupole: -124.7340 -132.4792 -123.2164
quadrupole: -3.1772 -1.9122 -2.8204
quadrupole: 2.0758 -5.6693 3.5935 -3.1772 -1.9122 -2.8204
hfenergy: -1665.1926867 hartree
pointgroup: C01 [X(C16H11Cl2N1O1)]
dipole: -0.6940402 -1.4013735 -1.258616 debye
polarizability: 303.3571071|-32.9185222|169.6902941|-10.819118|19.0554487|144.4391885 unknown
InChI: InChI=1S/C16H11Cl2NO/c17-10-5-6-12(14(18)8-10)15-13-7-9-3-1-2-4-11(9)16(13)20-19-15/h1-6,8,13,16H,7H2
charge 0 multiplicity 1
31 atoms
Cl 2.126274 1.81121 2.317624
Cl 6.101409 -1.257666 0.095918
O  -1.445503 2.253284 -0.087752
N  -0.096185 1.990907 0.322923
C  -0.617067 0.294487 -1.308104
C  -1.901711 1.132214 -1.041145
C  -0.976757 -1.199114 -0.984108
C  -2.864622 0.192401 -0.358052
C  -2.330974 -1.117603 -0.296911
C  0.380833 0.934871 -0.327767
C  -4.13014 0.490515 0.188678
C  -3.060176 -2.152023 0.326263
C  1.758661 0.443912 -0.1547
C  -4.862108 -0.546602 0.811188
C  -4.329179 -1.858689 0.879681
C  2.631695 0.757951 0.931368
C  2.287925 -0.432648 -1.152592
C  3.943508 0.247364 1.011911
C  3.593322 -0.953372 -1.099001
C  4.409532 -0.600403 -0.008444
H  -0.252381 0.399999 -2.345601
H  -2.311376 1.673343 -1.909167
H  -0.21121 -1.683146 -0.351227
H  -1.044294 -1.79137 -1.917332
H  -4.528797 1.509933 0.149506
H  -2.653954 -3.168307 0.384645
H  -5.844309 -0.336241 1.248327
H  -4.906029 -2.65189 1.368469
H  1.658145 -0.702032 -2.005083
H  4.581228 0.508379 1.859831
H  3.966343 -1.613264 -1.886447
