program: Gaussian 09
title: 000213953
version: EM64L-G09RevD.01
frameworkgroup: C1[X(C23H19ClN2O3S)]
method: RPBEPBE
basis: SDD
operation: Freq
keyword: #p
keyword: freq=noraman
keyword: PBEPBE/SDD
title: #p freq=noraman PBEPBE/SDD
converged: YES YES NO NO
title: Mulliken charges:
elementType: Cl S O O O N N C C C C C C C C C C C C C C C C C C C C C C C H H H H H H H H H H H H H H H H H H H
charge: -0.048442 0.905101 -0.527050 -0.558645 -0.232959 -0.236818 -0.025618 -0.383355 -0.612169 0.279076 0.258081 0.194669 -0.009311 -0.604244 -0.029028 -0.340693 -0.335944 0.295228 -0.244172 -0.139509 -0.263831 -0.273909 -0.333016 -0.391355 -0.204967 -0.202230 -0.216320 -0.248504 -0.231886 -0.238607 0.240174 0.316256 0.307464 0.275806 0.231717 0.272385 0.253379 0.298475 0.261042 0.287435 0.294512 0.286324 0.266900 0.243327 0.244401 0.239856 0.227741 0.226281 0.226947
chargesum: 0.00000
title: Mulliken charges with hydrogens summed into heavy atoms:
elementType: Cl S O O O N N C C C C C C C C C C C C C C C C C C C C C C C
charge: -0.048442 0.905101 -0.527050 -0.558645 -0.232959 -0.236818 -0.025618 0.173075 -0.028899 0.279076 0.258081 0.194669 -0.009311 -0.100142 -0.029028 -0.087313 -0.037468 0.295228 0.016871 -0.139509 0.023605 0.020603 -0.046692 -0.124455 0.038359 0.042171 0.023536 -0.020763 -0.005605 -0.011659
polarizability: 3.14596159e+02 2.46097216e+01 2.90754977e+02 4.14366680e+00 1.92043900e+01 3.18840429e+02
1716.lowfreq: -12.8475 -6.9876 -0.0016 0.0006 0.0011 1.6665 5.4740 13.9823 24.2187
frequency: -10.4998 13.6546 24.1643 36.5884 38.7646 51.8253 67.9649 70.7656 73.3940 85.2053 115.7867 131.7155 152.9551 165.6226 178.2390 189.9701 209.9824 239.1701 245.7536 250.1109 274.4170 281.7742 319.7266 322.4832 326.9252 339.2013 341.7550 368.5466 399.0017 403.5364 404.3280 420.8556 446.1348 456.0336 458.7215 484.2745 500.0772 519.7609 540.5245 549.7583 578.5158 602.5092 604.3722 615.6799 646.1499 656.7684 673.3069 681.9905 692.1106 695.0312 718.2918 750.7704 760.6084 778.0429 785.3157 786.6347 819.5140 849.6502 853.7232 857.8530 895.4590 902.7254 917.5795 929.8223 930.7855 935.1568 945.2414 953.0248 976.5807 978.7387 979.3739 984.3611 990.5827 994.3738 998.0510 1006.5955 1008.1582 1019.8877 1030.7421 1047.7208 1075.0696 1085.4693 1090.5022 1104.4835 1134.8867 1154.3734 1163.5183 1171.8954 1173.7899 1175.6477 1187.7184 1192.0356 1216.6806 1246.5846 1268.2573 1277.1631 1297.1213 1300.5565 1305.5319 1321.7868 1329.2958 1361.4780 1373.6201 1381.9791 1382.8427 1388.5201 1408.9156 1434.6979 1436.2644 1451.2677 1459.9484 1465.5098 1470.0359 1482.8552 1545.3129 1571.5328 1576.8493 1587.6819 1591.7093 1603.6270 1610.2529 1621.7085 2933.7193 2954.7887 3041.5109 3050.9405 3105.7296 3124.2965 3137.1759 3137.2166 3138.6697 3143.4200 3145.0812 3151.3842 3152.5791 3162.5066 3162.6865 3169.6927 3170.7790 3173.8864 3173.9068
redmass: 7.0110 7.3211 5.7382 5.9396 5.3380 5.4185 6.6109 6.4695 6.6049 6.6374 6.3314 6.2252 6.4549 5.7476 6.8706 5.6058 5.6160 6.6770 5.0928 3.7564 3.6199 4.3015 6.1107 5.2638 6.1495 5.2413 5.2694 7.0026 4.4721 2.8362 3.0524 5.3969 4.9957 5.4433 4.1842 3.8719 3.6789 4.5077 5.3772 4.1866 4.5027 6.4233 4.3961 6.3759 5.6211 6.8322 6.8702 4.9456 2.4084 1.6679 6.1340 3.8342 1.4491 5.7662 8.7447 2.3342 1.4377 1.2547 1.3760 2.0056 2.2259 1.5687 3.2418 4.3775 1.7020 1.3611 2.0000 1.9482 1.7091 5.5848 2.9185 1.3886 4.2935 2.7563 1.4295 1.3473 4.0224 2.6506 2.0649 2.1636 1.5531 1.6032 2.0961 2.8283 2.1684 1.5747 1.6234 1.0601 1.0584 1.1265 1.5574 1.1246 1.2408 1.6124 1.4371 2.1939 2.6730 1.3084 2.3277 1.3524 1.3464 1.5925 9.4745 8.1604 8.1734 2.9401 1.1154 2.2658 2.2470 2.0419 1.1131 1.3115 1.8494 2.3788 7.4841 7.9107 5.8198 6.6443 6.8663 6.9522 6.0310 9.3980 1.0688 1.0683 1.0818 1.0657 1.0924 1.0850 1.0889 1.0859 1.1085 1.0894 1.0883 1.0937 1.0927 1.0969 1.0952 1.0986 1.0938 1.1002 1.0977
irintensity: 2.6022 0.2229 0.7711 0.2249 0.7298 0.5462 1.6288 0.9922 0.4936 1.6833 2.0994 3.2263 0.0788 6.1680 2.1025 3.6994 0.0201 5.8567 3.8009 5.5721 3.8800 6.0556 3.8678 0.6414 11.5642 5.8756 1.3300 37.8491 15.1420 0.0932 2.0271 10.1489 0.8193 21.1755 9.3410 5.7142 5.1645 12.6981 64.2519 18.7223 14.7861 0.2446 9.1810 0.8544 5.9490 6.1989 0.8256 1.3258 26.7541 71.3610 23.7136 9.4045 82.2129 33.0986 46.2493 30.3939 51.5485 1.1907 3.9801 14.1376 35.8502 17.4478 6.6325 61.7365 1.3341 1.4028 8.6095 2.8630 0.9825 1.2416 2.5746 0.1238 1.3460 23.0758 2.0991 0.2486 2.0813 11.3245 8.2283 32.0059 5.7854 12.7041 11.2707 15.9071 20.6272 41.0843 9.7551 0.4870 0.0242 8.3200 51.3129 5.5970 21.2054 61.6909 27.0245 42.3556 78.0420 4.5604 31.9590 7.2500 8.6768 2.9054 13.1418 0.8843 5.8745 32.2058 18.5939 14.4126 15.4842 16.2698 17.0501 14.9286 142.4262 3.5532 38.5933 14.9680 4.3038 1.3481 14.4319 1.1540 6.5191 360.4018 34.2694 29.8731 13.7318 5.2490 13.9875 0.1706 15.7754 0.1730 2.3919 6.7484 7.2165 27.8572 0.1556 5.5129 13.3407 14.0756 4.6242 21.3362 13.8635
temp: 298.150 k
press: 1.00000 atm
elementType: 17 16 8 8 8 7 7 6 6 6 6 6 6 6 6 6 6 6 6 6 6 6 6 6 6 6 6 6 6 6 1 1 1 1 1 1 1 1 1 1 1 1 1 1 1 1 1 1 1
symmnumber: 1
zpe: 957253.1 jmol-1
zpe.correction: 0.364598 hartree
zpe.thermalcorrener: 0.390470 hartree
zpe.thermalcorrenthalpy: 0.391414 hartree
zpe.thermalcorrgfe: 0.306732 hartree
zpe.sumelectzpe: -2078.868114 hartree
zpe.sumelectthermal: -2078.842243 hartree
zpe.sumelectthermalent: -2078.841298 hartree
zpe.sumelectthermalfe: -2078.925980 hartree
dipole: -5.0533 -2.9711 5.8001
dipole: 8.2464
quadrupole: -154.0963 -173.9274 -207.7086
quadrupole: 4.2151 -16.4829 0.3314
quadrupole: 24.4811 4.6500 -29.1312 4.2151 -16.4829 0.3314
hfenergy: -2079.2327128 hartree
pointgroup: C01 [X(C23H19Cl1N2O3S1)]
dipole: 1.9761295 0.5090289 2.5222773 debye
polarizability: 312.9859287|24.9967496|305.6319952|4.0549609|-23.6931889|305.5736417 unknown
InChI: InChI=1S/C23H19ClN2O3S/c24-18-11-12-21-20(15-18)23(17-7-3-1-4-8-17)25-16-22(27)26(21)13-14-30(28,29)19-9-5-2-6-10-19/h1-12,15H,13-14,16H2
charge 0 multiplicity 1
49 atoms
Cl -3.634583 0.046966 4.172503
S  2.143686 0.116487 -0.246412
O  2.289478 0.445395 -1.841649
O  1.061632 -0.966526 0.340091
O  -0.280899 3.199798 -2.623801
N  -0.426141 2.233334 -0.499523
N  -2.441013 0.582739 -2.068296
C  0.95045 2.719289 -0.232187
C  1.791045 1.81628 0.659468
C  -1.235929 1.713755 0.564307
C  -2.077467 0.568225 0.387625
C  -0.953301 2.554247 -1.778077
C  -2.286248 -0.089797 -0.943712
C  -2.381337 2.060649 -2.029991
C  3.858761 -0.403551 0.386259
C  -1.150866 2.327279 1.843657
C  -2.800129 0.075652 1.509061
C  -2.418334 -1.57785 -1.010607
C  -1.87053 1.832164 2.946566
C  -2.690323 0.702082 2.757915
C  3.923896 -1.191763 1.546149
C  4.976872 -0.025779 -0.374581
C  -1.69327 -2.426628 -0.131774
C  -3.259416 -2.156964 -1.998764
C  5.205216 -1.599393 1.987121
C  6.248656 -0.44497 0.082157
C  6.359652 -1.221396 1.260538
C  -1.82486 -3.828392 -0.232122
C  -3.391325 -3.556865 -2.092709
C  -2.677414 -4.398552 -1.205404
H  0.936804 3.733218 0.222482
H  1.423592 2.829154 -1.225436
H  1.326059 1.495398 1.603228
H  2.788249 2.252783 0.82988
H  -3.046339 2.486419 -1.245018
H  -2.686489 2.450566 -3.011741
H  -0.530814 3.220128 1.975108
H  -3.442687 -0.800012 1.385645
H  -1.804315 2.319456 3.923351
H  3.00755 -1.499015 2.061124
H  4.850322 0.542837 -1.302308
H  -0.991435 -1.991096 0.585622
H  -3.791779 -1.490173 -2.68422
H  5.298781 -2.216671 2.886622
H  7.145058 -0.174931 -0.485644
H  7.347556 -1.545737 1.605061
H  -1.249245 -4.475372 0.439072
H  -4.048277 -3.993447 -2.853321
H  -2.77975 -5.487421 -1.278117
