program: Gaussian 09
title: 000213907
version: EM64L-G09RevD.01
frameworkgroup: C1[X(C18H18N2O)]
method: RPBEPBE
basis: SDD
operation: Freq
keyword: #p
keyword: freq=noraman
keyword: PBEPBE/SDD
title: #p freq=noraman PBEPBE/SDD
converged: YES YES NO NO
title: Mulliken charges:
elementType: O N N C C C C C C C C C C C C C C C C C C H H H H H H H H H H H H H H H H H H
charge: -0.280006 -0.126271 -0.625902 -0.215675 -0.275963 -0.579292 -0.323874 0.333764 0.302623 0.462792 -0.416458 -0.424747 0.165916 -0.237364 -0.224329 -0.416766 -0.407203 -0.400916 -0.400503 0.435883 -0.811788 0.255955 0.244246 0.240087 0.257670 0.236362 0.249761 0.244456 0.227494 0.225822 0.222049 0.279294 0.224220 0.224259 0.326619 0.329282 0.222404 0.231905 0.224193
chargesum: 0.00000
title: Mulliken charges with hydrogens summed into heavy atoms:
elementType: O N N C C C C C C C C C C C C C C C C C C
charge: -0.280006 -0.126271 0.029998 0.040279 -0.031717 -0.081534 -0.087511 0.333764 0.302623 0.462792 -0.166697 -0.180291 0.165916 -0.009870 0.001493 -0.194717 -0.127908 -0.176696 -0.176244 0.435883 -0.133286
polarizability: 2.75385725e+02 -1.60733459e+01 1.74376030e+02 -6.99101597e+00 2.76246182e+00 1.62940525e+02
1716.lowfreq: -24.1840 -9.1720 -3.0130 -0.0003 0.0006 0.0008 12.6373 26.1469 34.3633
frequency: -23.8789 25.8755 34.2842 48.0758 69.2190 92.9003 130.7678 141.2997 181.5584 211.4631 246.3969 266.4268 295.2969 317.8917 343.3872 362.3001 369.6703 408.7365 422.4037 427.5254 459.4698 468.3766 505.3174 518.3853 542.7587 555.9223 584.5480 600.0235 637.4427 653.6122 687.6306 711.0113 728.7558 735.9907 760.5391 769.9701 789.7627 814.7538 823.0240 840.9335 854.1214 859.9206 876.1487 879.5228 897.2572 943.1803 951.6647 956.0795 984.5376 987.3873 989.2202 1004.1042 1015.1086 1022.1514 1028.9783 1046.7257 1076.5798 1106.4564 1116.2614 1143.3043 1157.3262 1169.9171 1177.8501 1183.1755 1197.2637 1211.2091 1217.8349 1221.0866 1251.4088 1253.0991 1280.3942 1285.3366 1298.9395 1304.0305 1321.8114 1327.2280 1344.1036 1376.2689 1391.2526 1396.0993 1404.3543 1448.9833 1455.1143 1472.4073 1473.4544 1475.7853 1507.7406 1576.4467 1585.6322 1596.3957 1618.7775 1626.2649 1672.5142 2908.7313 2971.7568 2997.9085 3012.1960 3052.0239 3052.4191 3062.6649 3081.7734 3099.0154 3116.6916 3121.2993 3128.6736 3130.0763 3142.3565 3159.5417 3160.4975 3571.9124 3730.4429
redmass: 1.0188 4.7983 4.2541 3.9486 4.1298 4.8825 4.1224 5.1282 4.1991 5.2009 3.2354 4.1027 5.1238 3.7405 3.4860 2.1404 1.4901 2.8783 3.1750 2.9685 1.8900 1.4861 3.4824 4.4536 4.0980 4.0070 5.3357 5.7012 6.8368 8.3307 4.6937 3.2021 3.5820 3.7777 1.6082 2.4189 3.7251 2.6997 3.0285 2.0553 4.3322 1.3376 3.4521 1.4709 4.1422 1.7013 1.3549 2.1151 1.3937 1.3679 1.3239 2.6276 2.7509 2.2206 2.2446 1.5555 3.2708 2.1916 1.3163 1.4056 1.9146 1.0744 2.1222 1.1939 1.5726 2.0359 1.6618 2.5527 1.3398 1.3768 1.5550 1.8339 1.4606 1.4427 1.5059 1.7120 2.1786 4.5512 6.5074 1.2264 3.1119 2.3556 1.1975 1.0928 1.0534 2.3804 2.7736 1.3259 4.6166 6.8844 7.0601 6.4823 7.1069 1.0819 1.0387 1.0632 1.0843 1.0886 1.0948 1.0985 1.0996 1.0870 1.0895 1.0853 1.0958 1.0894 1.0951 1.0939 1.1004 1.0439 1.1060
irintensity: 0.5071 0.1475 0.1592 0.0879 0.5750 0.4806 1.5202 1.3524 0.4236 1.4800 6.1199 1.4135 1.6607 2.0087 38.1449 69.1624 176.3260 0.0959 8.1782 5.2661 12.5899 23.0431 4.9792 19.5507 1.2605 6.0805 4.2287 15.9246 0.1679 9.9529 6.9248 1.4025 3.0883 32.0834 47.3116 19.3537 4.8237 4.0123 14.1839 32.8542 5.1243 11.1431 15.0731 0.3407 39.5950 23.7355 2.1887 95.7730 1.1599 1.7428 0.3949 13.5664 11.3333 2.2586 0.1484 16.6133 5.8364 12.7819 13.2535 2.4487 23.5034 1.0896 5.3900 12.0113 10.5667 15.1611 4.3988 0.6419 13.6979 11.8486 63.9864 5.0991 37.0113 8.7625 36.1634 32.6531 83.2206 13.1327 3.4488 9.0069 2.8370 1.6588 27.1121 16.1239 12.8420 9.2134 42.5323 56.1364 17.8520 0.5518 7.4232 0.5900 664.2543 39.8598 46.7451 12.0952 11.4479 27.9858 27.2627 20.1478 19.3175 18.3253 27.6055 1.2404 26.1118 3.6950 30.0962 4.1586 36.1261 82.0606 40.1991
temp: 298.150 k
press: 1.00000 atm
elementType: 8 7 7 6 6 6 6 6 6 6 6 6 6 6 6 6 6 6 6 6 6 1 1 1 1 1 1 1 1 1 1 1 1 1 1 1 1 1 1
symmnumber: 1
zpe: 832014.2 jmol-1
zpe.correction: 0.316897 hartree
zpe.thermalcorrener: 0.334001 hartree
zpe.thermalcorrenthalpy: 0.334945 hartree
zpe.thermalcorrgfe: 0.271037 hartree
zpe.sumelectzpe: -879.962371 hartree
zpe.sumelectthermal: -879.945268 hartree
zpe.sumelectthermalent: -879.944324 hartree
zpe.sumelectthermalfe: -880.008232 hartree
dipole: -1.4464 -0.7949 -0.2366
dipole: 1.6673
quadrupole: -112.3550 -117.7331 -114.2946
quadrupole: -6.7813 0.9388 -3.2944
quadrupole: 2.4392 -2.9389 0.4997 -6.7813 0.9388 -3.2944
hfenergy: -880.2792689 hartree
pointgroup: C01 [X(C18H18N2O1)]
dipole: -0.581431 0.2960564 0.0675512 debye
polarizability: 273.8397092|20.0951704|176.0057218|7.5423252|2.6142962|162.8568483 unknown
InChI: InChI=1S/C18H18N2O/c1-11-6-8-12(9-7-11)16-15-10-13-4-2-3-5-14(13)17(15)21-18(19)20-16/h2-9,15-17H,10,19H2,1H3
charge 0 multiplicity 1
39 atoms
O  -1.843343 -2.069822 -0.440999
N  0.399233 -1.974687 0.51188
N  -1.317138 -3.345377 1.383721
C  -0.329183 -0.03596 -0.879384
C  -1.698713 -0.735075 -1.142772
C  -0.584696 0.971224 0.286858
C  0.793984 -1.080871 -0.60201
C  -2.719484 0.236943 -0.585983
C  -2.086753 1.20484 0.235545
C  2.135317 -0.404735 -0.313975
C  -4.115652 0.239805 -0.776693
C  -2.857436 2.197329 0.875472
C  -0.82992 -2.411403 0.490731
C  -4.888285 1.236777 -0.134719
C  -4.261025 2.20839 0.684702
C  2.826114 0.268699 -1.351944
C  2.707802 -0.4191 0.978387
C  4.052158 0.921206 -1.100605
C  3.935034 0.234988 1.227574
C  4.626377 0.922476 0.197617
C  5.931704 1.649491 0.476131
H  -0.079042 0.539324 -1.790905
H  -1.857516 -0.999568 -2.20168
H  0.000982 1.898707 0.16448
H  -0.289913 0.528393 1.257729
H  0.909462 -1.683688 -1.532493
H  -4.595629 -0.515322 -1.409557
H  -2.380787 2.953458 1.509954
H  -5.974868 1.262982 -0.273547
H  -4.870151 2.978249 1.172453
H  2.413243 0.272225 -2.369907
H  2.186607 -0.973431 1.764894
H  4.574739 1.42937 -1.920917
H  4.36742 0.206631 2.235967
H  -0.671097 -3.772154 2.040519
H  -2.309527 -3.558928 1.400132
H  6.58491 1.666288 -0.414592
H  5.748721 2.702283 0.768266
H  6.491252 1.173542 1.300865
