program: Gaussian 09
title: 000213906
version: EM64L-G09RevD.01
frameworkgroup: C1[X(C16H17NO)]
method: RPBEPBE
basis: SDD
operation: Freq
keyword: #p
keyword: freq=noraman
keyword: PBEPBE/SDD
title: #p freq=noraman PBEPBE/SDD
converged: YES YES NO NO
title: Mulliken charges:
elementType: O N C C C C C C C C C C C C C C C C H H H H H H H H H H H H H H H H H
charge: -0.448986 -0.583597 -0.151805 -0.301252 -0.595941 -0.313040 0.225311 0.292913 0.553962 -0.400896 -0.421125 -0.234291 -0.225417 -0.442406 -0.390580 -0.230571 -0.248312 -0.244056 0.240551 0.249325 0.227503 0.246481 0.200015 0.253265 0.243696 0.311495 0.260919 0.339782 0.228670 0.226770 0.233134 0.224042 0.224399 0.222906 0.227138
chargesum: 0.00000
title: Mulliken charges with hydrogens summed into heavy atoms:
elementType: O N C C C C C C C C C C C C C C C C
charge: -0.109204 -0.011183 0.088746 -0.051927 -0.121958 -0.113025 0.225311 0.292913 0.553962 -0.147632 -0.177429 -0.005621 0.001353 -0.209272 -0.166538 -0.006173 -0.025406 -0.016919
polarizability: 2.30134942e+02 1.31263930e+01 1.60280387e+02 6.93593930e+00 2.58871676e+00 1.31082609e+02
1716.lowfreq: -17.4168 -8.5223 -0.0008 -0.0006 -0.0002 4.5521 5.4584 37.8605 46.8416
frequency: -16.9421 37.7946 46.8012 75.5117 115.3611 156.7252 182.1204 198.5054 227.7187 246.4164 276.2745 288.1458 332.2890 336.1756 365.3215 402.6850 419.2745 441.6908 505.3001 533.5000 546.4525 568.3161 593.2485 604.3134 615.9367 631.1346 696.1490 705.7015 728.1329 758.5727 773.8990 781.1797 798.6576 815.3454 852.2901 861.9539 879.3309 918.3734 921.0707 947.2864 974.7868 981.2033 990.3205 990.8967 994.0183 1021.0074 1023.0930 1041.2415 1067.0823 1075.6469 1094.3154 1108.4883 1128.7844 1145.1252 1169.5314 1171.1231 1176.2766 1183.4730 1188.7295 1199.2451 1211.8410 1222.9710 1260.8241 1276.7395 1296.2065 1298.3146 1315.5951 1345.7908 1358.0392 1368.0999 1384.4531 1389.5133 1439.2612 1447.6562 1460.4174 1474.7086 1483.8233 1592.8085 1594.0840 1606.5202 1615.8864 1617.2043 2964.7720 2975.5622 2993.6189 3049.4554 3063.6693 3114.2385 3119.0360 3121.3702 3130.5763 3131.9216 3142.6160 3142.8035 3160.7299 3160.9537 3450.0167 3552.2010 3592.4767
redmass: 3.7867 4.0437 4.6489 4.9317 4.2334 4.1544 3.9703 4.4444 3.0419 1.7203 3.6876 1.3470 3.8711 1.9684 2.6440 2.8073 3.0577 2.6896 3.3122 4.1285 3.0693 3.7013 2.8239 2.4725 5.8996 3.3114 2.9686 1.6424 4.1059 1.4744 2.0341 2.7713 3.1416 3.4460 1.2494 3.1109 1.4411 2.0981 1.7430 1.5901 1.3941 2.2031 4.4358 1.3296 1.4292 2.2110 2.5864 3.0303 2.3678 2.2622 2.5398 2.0426 1.3046 1.4017 1.0799 1.0666 1.9589 1.2396 1.1482 1.4777 1.8399 1.6709 1.5482 1.7942 1.5528 1.3994 1.4502 1.1806 1.6058 1.1798 5.5254 6.0370 2.1371 2.4223 1.2820 2.0150 2.3152 5.8637 6.8153 1.5687 7.0335 2.2999 1.0689 1.0811 1.0852 1.0932 1.0878 1.0853 1.0867 1.0855 1.0892 1.0912 1.0960 1.0950 1.1006 1.1013 1.0436 1.0662 1.0993
irintensity: 0.2255 0.0521 0.1620 0.5546 1.2139 3.5181 0.6835 0.8353 3.5902 58.7472 32.1068 110.7556 14.4010 17.3158 1.2680 0.2484 4.5305 13.3031 6.3685 3.9924 27.3046 39.5346 67.5696 130.9428 2.8814 78.9746 13.4538 71.5501 0.9720 98.9172 33.5846 6.3356 11.7431 8.1708 0.2009 3.8412 0.0706 24.1456 24.5940 12.4302 0.0975 13.0498 0.1490 0.1047 0.2921 3.7043 11.3251 7.4139 9.3418 17.0611 17.5307 3.4978 11.0044 10.3489 0.5109 0.7235 1.4373 32.4318 3.4957 8.9429 4.2887 15.4962 0.2565 0.5001 6.6799 5.3867 8.2574 5.4333 16.8145 29.6263 1.9922 4.5319 9.6299 4.7377 20.8204 9.8713 9.9202 2.4557 0.9863 28.0535 7.9753 20.4254 22.0340 0.6627 45.6649 16.0323 28.6955 11.3054 1.9765 1.6583 3.5519 15.4754 45.7085 28.9792 49.5617 10.9183 2.7373 6.1826 5.7714
temp: 298.150 k
press: 1.00000 atm
elementType: 8 7 6 6 6 6 6 6 6 6 6 6 6 6 6 6 6 6 1 1 1 1 1 1 1 1 1 1 1 1 1 1 1 1 1
symmnumber: 1
zpe: 758648.5 jmol-1
zpe.correction: 0.288954 hartree
zpe.thermalcorrener: 0.303835 hartree
zpe.thermalcorrenthalpy: 0.304779 hartree
zpe.thermalcorrgfe: 0.246891 hartree
zpe.sumelectzpe: -748.577436 hartree
zpe.sumelectthermal: -748.562556 hartree
zpe.sumelectthermalent: -748.561611 hartree
zpe.sumelectthermalfe: -748.619499 hartree
dipole: 1.1661 -2.1227 0.3879
dipole: 2.4528
quadrupole: -100.6791 -110.1759 -99.1091
quadrupole: 4.2895 -0.9935 3.1872
quadrupole: 2.6423 -6.8545 4.2123 4.2895 -0.9935 3.1872
hfenergy: -748.8663902 hartree
pointgroup: C01 [X(C16H17N1O1)]
dipole: 0.4526663 0.7733136 -0.3582328 debye
polarizability: 229.3800442|-15.2241039|160.1986779|-7.6969338|-3.5519949|131.9192154 unknown
InChI: InChI=1S/C16H17NO/c17-15(11-6-2-1-3-7-11)14-10-12-8-4-5-9-13(12)16(14)18/h1-9,14-16,18H,10,17H2
charge 0 multiplicity 1
35 atoms
O  1.459114 -2.167283 1.178375
N  -1.420614 -2.485789 0.324809
C  0.119187 -0.545508 -0.298864
C  1.403155 -1.432114 -0.117599
C  0.559005 0.915559 0.039047
C  -1.111095 -1.051784 0.515349
C  2.545192 -0.438938 -0.25078
C  2.069572 0.894069 -0.144172
C  -2.369928 -0.220048 0.24567
C  3.920588 -0.710293 -0.409901
C  2.975228 1.974359 -0.204983
C  4.827881 0.373748 -0.472612
C  4.355894 1.706894 -0.372073
C  -3.179031 0.21627 1.32424
C  -2.783771 0.093471 -1.075244
C  -4.364881 0.949375 1.096246
C  -3.973272 0.819525 -1.310892
C  -4.767599 1.253477 -0.22491
H  -0.1236 -0.588018 -1.379997
H  1.443452 -2.254102 -0.850289
H  0.290657 1.180649 1.08341
H  0.05783 1.658637 -0.605896
H  -0.856205 -0.934278 1.587634
H  4.278801 -1.743459 -0.482641
H  2.619513 3.008481 -0.128375
H  -0.647881 -3.097429 0.608177
H  -1.837349 -2.721165 -0.580542
H  1.693193 -1.526158 1.897327
H  5.899303 0.185108 -0.603542
H  5.068318 2.538163 -0.426565
H  -2.87973 -0.033068 2.349543
H  -2.177768 -0.227571 -1.931602
H  -4.974948 1.279584 1.944818
H  -4.278124 1.049311 -2.338439
H  -5.687785 1.820623 -0.405426
