program: Gaussian 09
title: 000213872
version: EM64L-G09RevD.01
frameworkgroup: C1[X(C12H11N3O2)]
method: RPBEPBE
basis: SDD
operation: Freq
keyword: #p
keyword: freq=noraman
keyword: PBEPBE/SDD
title: #p freq=noraman PBEPBE/SDD
converged: NO YES NO NO
title: Mulliken charges:
elementType: O O N N N C C C C C C C C C C C C H H H H H H H H H H H
charge: -0.293870 -0.297384 -0.225508 -0.115883 -0.105868 0.291504 0.465381 0.038520 -0.545065 -0.568135 -0.353192 0.226311 0.213885 -0.218215 -0.211344 -0.528780 -0.529350 0.296680 0.257548 0.244356 0.253094 0.270576 0.235150 0.251999 0.229666 0.258617 0.225825 0.233481
chargesum: 0.00000
title: Mulliken charges with hydrogens summed into heavy atoms:
elementType: O O N N N C C C C C C C C C C C C
charge: -0.293870 -0.297384 -0.225508 -0.115883 -0.105868 0.291504 0.465381 0.038520 -0.248385 -0.310587 -0.108836 0.226311 0.213885 0.034879 0.059232 0.188035 0.188573
polarizability: 2.69417223e+02 8.11757090e-01 1.59242815e+02 -2.44177760e-02 -6.01456718e+00 7.66446798e+01
1716.lowfreq: -15.5593 -7.3489 -0.0006 0.0003 0.0003 3.2882 52.1941 68.1473 102.1187
frequency: 52.0931 68.1451 102.1041 110.5722 151.3566 158.1335 162.2799 169.6416 210.4305 237.6692 263.5477 297.9804 323.8982 346.2831 405.6655 422.9290 457.9557 495.0594 533.1552 556.8049 618.6663 638.3365 643.6914 663.3654 707.6771 727.0414 736.0988 750.4521 783.0361 790.8865 838.8064 895.1332 903.6622 913.2008 924.1554 940.2318 946.2683 948.7312 1014.3266 1096.8770 1111.7943 1113.3466 1121.2403 1149.6631 1156.3391 1162.6785 1183.8481 1207.7365 1228.2872 1242.9026 1278.3564 1310.6566 1355.4794 1376.6164 1401.8195 1422.0279 1429.9682 1449.9722 1458.3425 1462.0081 1474.7507 1478.4361 1486.1267 1513.3847 1524.8091 1615.6827 1638.6749 2977.0070 2978.9928 3074.9939 3078.1302 3127.1024 3127.3759 3153.2641 3163.0642 3173.8223 3194.5074 3251.1924
redmass: 3.7756 4.2301 3.4210 3.2915 1.6526 1.2532 1.8354 3.2823 4.5266 4.9086 4.4599 6.3700 6.5854 5.7432 5.3767 4.8416 5.0397 3.6907 6.3909 4.4328 7.2142 4.5958 4.8702 4.7180 6.7217 4.5555 1.8864 2.6858 3.6798 1.5465 6.8442 1.7480 4.2669 5.7970 1.6125 1.3610 8.8159 6.5818 3.9199 2.4704 1.2443 1.2622 2.2821 1.3562 1.5251 1.6731 1.8831 3.8114 1.4945 2.7746 3.4196 3.6306 5.8246 3.8637 2.8227 1.3280 1.3747 2.0955 1.0568 1.1613 1.2990 2.3245 1.0535 6.5991 9.1658 6.7840 7.2374 1.0304 1.0309 1.1048 1.1040 1.1029 1.1033 1.0922 1.0884 1.0930 1.0994 1.0993
irintensity: 1.2410 8.3611 7.4351 5.7810 2.4418 0.4571 1.0219 2.6879 6.7129 5.8787 4.8713 3.1653 4.5716 1.2910 10.1023 7.5680 6.7194 3.3479 2.7701 1.3065 1.6820 9.6133 12.8688 19.6385 2.2129 5.8061 15.4978 9.1628 0.6283 46.4384 11.3200 17.8358 25.8350 9.2279 31.4544 8.6473 17.0258 87.1317 35.0703 17.3802 27.8717 4.6876 25.6439 4.6339 8.1772 47.5937 68.6271 17.3251 30.7443 10.1400 168.3419 8.5230 9.3245 13.6597 16.5957 17.4903 12.4545 128.6170 19.9711 2.2764 36.5481 52.2763 22.0010 16.0255 30.0726 4.7569 9.0952 78.3458 73.6565 27.1583 20.8635 20.3706 24.3621 3.5663 3.8280 1.8974 5.7879 0.1839
temp: 298.150 k
press: 1.00000 atm
elementType: 8 8 7 7 7 6 6 6 6 6 6 6 6 6 6 6 6 1 1 1 1 1 1 1 1 1 1 1
symmnumber: 1
zpe: 554234.4 jmol-1
zpe.correction: 0.211097 hartree
zpe.thermalcorrener: 0.225564 hartree
zpe.thermalcorrenthalpy: 0.226508 hartree
zpe.thermalcorrgfe: 0.169687 hartree
zpe.sumelectzpe: -777.316994 hartree
zpe.sumelectthermal: -777.302527 hartree
zpe.sumelectthermalent: -777.301582 hartree
zpe.sumelectthermalfe: -777.358404 hartree
dipole: 2.9362 5.4845 -0.9089
dipole: 6.2871
quadrupole: -86.2807 -100.9316 -99.5814
quadrupole: -22.8004 4.2655 5.3112
quadrupole: 9.3172 -5.3337 -3.9835 -22.8004 4.2655 5.3112
hfenergy: -777.5280909 hartree
pointgroup: C01 [X(C12H11N3O2)]
dipole: 1.225513 2.0846203 -0.5203763 debye
polarizability: 269.3295677|-3.1126209|158.0043054|-1.4628065|-11.9395278|77.9708448 unknown
InChI: InChI=1S/C12H11N3O2/c1-16-10-5-8-3-4-15-7-13-14-12(15)9(8)6-11(10)17-2/h3-7H,1-2H3
charge 0 multiplicity 1
28 atoms
O  2.754527 -1.737768 0.329604
O  3.46491 1.035364 -0.253719
N  -2.978761 0.514955 -0.039695
N  -2.606506 -1.674526 0.450968
N  -4.009082 -1.438162 0.419799
C  -0.599839 -0.14644 0.070525
C  -0.259664 1.21605 -0.248003
C  -1.999677 -0.488769 0.173379
C  0.422164 -1.113135 0.252539
C  1.114363 1.573917 -0.337311
C  -1.320482 2.189798 -0.451156
C  1.77022 -0.747605 0.132801
C  2.122448 0.621444 -0.132976
C  -2.646323 1.841945 -0.347962
C  -4.203513 -0.134376 0.128462
C  3.593277 -2.028925 -0.860008
C  4.288631 0.869785 0.970425
H  0.160859 -2.152386 0.470909
H  1.410555 2.605636 -0.553741
H  -1.061664 3.224649 -0.691718
H  -3.474198 2.538489 -0.491686
H  -5.169861 0.352531 0.033831
H  4.326028 -2.77666 -0.521967
H  4.103697 -1.117325 -1.218849
H  2.965977 -2.45329 -1.665671
H  4.28979 -0.181168 1.308756
H  3.901376 1.524144 1.773487
H  5.301949 1.187225 0.682576
