program: Gaussian 09
title: 000012349
version: EM64L-G09RevD.01
frameworkgroup: C1[X(C5H11NO3)]
method: RPBEPBE
basis: SDD
operation: Freq
keyword: #p
keyword: freq=noraman
keyword: PBEPBE/SDD
title: #p freq=noraman PBEPBE/SDD
converged: NO NO NO NO
title: Mulliken charges:
elementType: O O O N C C C C C H H H H H H H H H H H
charge: -0.279281 -0.306094 -0.278762 -0.617800 -0.262513 -0.268554 -0.203494 -0.674875 0.301547 0.198721 0.198210 0.239984 0.239859 0.188132 0.188003 0.202308 0.229714 0.229746 0.334241 0.340910
chargesum: 0.00000
title: Mulliken charges with hydrogens summed into heavy atoms:
elementType: O O O N C C C C C
charge: -0.279281 -0.306094 -0.278762 0.057350 0.134418 0.211288 0.172642 -0.013108 0.301547
polarizability: 1.00525169e+02 2.89796574e+00 6.90785378e+01 3.12135454e-02 2.24190363e-02 5.08330002e+01
1716.lowfreq: -0.0015 -0.0011 -0.0008 7.4996 10.9417 29.6147 38.3489 52.2771 80.2450
frequency: 36.2066 51.1984 80.2403 87.0862 117.6814 165.5444 193.9298 242.1472 255.0337 356.3957 451.7256 489.1892 493.2035 516.9032 623.9594 705.2187 808.3623 813.7707 824.9398 868.0324 1003.3150 1023.1016 1057.5106 1078.7898 1089.6624 1107.5998 1133.2204 1142.5960 1177.6719 1249.5508 1253.2582 1290.3618 1330.3298 1367.7408 1393.1058 1416.5721 1460.1617 1476.2808 1483.3491 1489.9256 1498.6734 1586.2584 1683.2453 2910.3757 2931.7437 2956.6958 2981.3929 2992.3876 3024.1172 3089.0679 3094.7307 3101.7556 3560.0883 3719.1998
redmass: 3.6624 2.4529 4.2278 2.5784 2.6262 3.6781 4.4140 1.1433 5.1388 3.4462 3.4204 1.1913 3.1670 1.0465 5.8573 10.9603 4.1031 1.0867 1.0982 3.2207 3.6835 6.7370 2.0921 5.8893 2.6010 1.4445 2.3647 1.4382 1.1522 1.1358 1.1462 1.7761 1.6303 1.4683 1.2603 1.5542 1.0407 1.0661 1.0626 1.0809 1.0797 1.2172 7.3316 1.0552 1.0549 1.1065 1.1068 1.0360 1.0571 1.0988 1.1092 1.1011 1.0442 1.1061
irintensity: 0.7380 0.4252 1.1247 2.0896 0.0025 18.3745 6.5476 0.6924 3.4423 16.1491 1.9185 329.5276 8.9153 8.3774 1.6298 34.3027 33.4510 1.5238 3.4345 2.3916 8.8467 110.9312 53.1603 224.5978 11.9002 0.3169 9.1189 4.4198 7.0676 0.0003 0.2220 308.6506 73.1698 80.0140 40.5523 1.2035 11.1435 7.7695 5.3833 3.5323 6.4171 100.1106 373.7838 53.7433 79.3473 70.2570 48.4295 22.9796 19.2250 35.0110 29.7948 39.0082 61.1223 50.1652
temp: 298.150 k
press: 1.00000 atm
elementType: 8 8 8 7 6 6 6 6 6 1 1 1 1 1 1 1 1 1 1 1
symmnumber: 1
zpe: 432657.0 jmol-1
zpe.correction: 0.164790 hartree
zpe.thermalcorrener: 0.175891 hartree
zpe.thermalcorrenthalpy: 0.176835 hartree
zpe.thermalcorrgfe: 0.126610 hartree
zpe.sumelectzpe: -476.808107 hartree
zpe.sumelectthermal: -476.797007 hartree
zpe.sumelectthermalent: -476.796063 hartree
zpe.sumelectthermalfe: -476.846288 hartree
dipole: 0.2563 -4.0653 0.0100
dipole: 4.0734
quadrupole: -39.6114 -56.8875 -54.5266
quadrupole: 7.7526 0.0740 0.0076
quadrupole: 10.7304 -6.5456 -4.1848 7.7526 0.0740 0.0076
hfenergy: -476.9728976 hartree
pointgroup: C01 [X(C5H11N1O3)]
dipole: -0.1154422 -1.5983947 -0.0101616 debye
dipolederiv: -1.2901569 0.0116669 -0.0018369 -0.0330172 -0.4102299 0.0004071 -0.0017333 -0.0004159 -0.4290518 -1.7758661 -0.0814004 -0.0016244 -0.3373444 -0.5347127 -0.0007986 -0.0022634 -0.0003865 -0.3100128 -0.7163027 -0.0582123 -0.0005007 -0.1541623 -1.076052 -0.0012596 -0.0007791 -0.0015364 -0.3602164 -1.0216802 0.4696422 0.0007123 0.4966699 -0.6744021 0.0006782 0.000683 0.0007035 -0.7524041 0.674796 -0.1264901 0.000312 -0.2782569 0.3248341 -0.0015495 -0.0027921 -0.001026 0.4434132 0.813772 -0.093979 -0.0000701 -0.2531134 0.2473765 -0.0006663 0.0004174 -0.0002186 0.3480024 0.8650065 0.1011778 0.0021906 0.3097355 0.3362515 -0.0009704 0.0054862 -0.0010219 0.4538991 -0.1296471 0.0793727 0.0008379 0.0667498 0.0038264 -0.0004626 0.000463 -0.0004119 0.0539807 2.2432637 -0.2088054 0.0018471 0.1474874 1.648267 0.0022402 0.0025216 0.002022 0.344384 -0.0238366 0.0025937 0.0247748 0.0701131 -0.0616893 0.1113665 -0.0244716 0.1419445 -0.1139521 -0.0234862 0.0017509 -0.0261322 0.0685991 -0.0582883 -0.1105236 0.0247333 -0.1413161 -0.1177881 -0.0068608 0.0050432 -0.0199269 0.062426 0.0087703 -0.0753714 0.0065405 -0.089027 -0.0530963 -0.0073306 0.0041924 0.0202452 0.0619755 0.0075955 0.0760154 -0.0060225 0.0894665 -0.0521927 -0.0514484 0.0177729 0.029997 -0.0825042 -0.0729762 -0.1290903 -0.0358355 -0.1579288 -0.1313922 -0.0515871 0.0176155 -0.028884 -0.0842522 -0.081236 0.1301153 0.034072 0.1594019 -0.1232828 -0.1489628 -0.0843079 -0.0018975 -0.111962 0.0262424 -0.0016231 -0.0023845 -0.0015174 0.1113161 0.107589 -0.0093077 -0.0252761 0.0395577 0.0080748 -0.1066803 0.0045813 -0.1211897 -0.068809 0.1075673 -0.0107719 0.025912 0.0390054 0.0013342 0.1089423 -0.0024035 0.1231429 -0.0618092 0.2109677 -0.0063346 -0.0003298 -0.0416768 0.1839765 -0.0003957 -0.000461 -0.0002933 0.4120883 0.2242032 -0.031219 -0.0003503 0.0139702 0.1730371 -0.0003735 -0.0003516 -0.0003917 0.4069236 unknown
polarizability: 100.4695521|-3.1849482|69.1340279|0.0429201|0.0462865|50.8331271 unknown
InChI: InChI=1S/C5H11NO3/c1-2-8-3-4-9-5(6)7/h2-4,6H2,1H3
charge 0 multiplicity 1
20 atoms
O  -2.11049 0.23649 0.004666
O  1.467051 -0.562457 -0.001068
O  2.830118 1.364041 0.004087
N  3.728669 -0.808543 0.001349
C  -0.928812 -0.626784 -0.004411
C  0.273689 0.316424 -0.000654
C  -3.36778 -0.525727 -0.008836
C  -4.517669 0.480826 0.002835
C  2.703995 0.113858 0.001382
H  -0.907945 -1.284366 0.892657
H  -0.912993 -1.272119 -0.910459
H  0.278003 0.958977 0.897127
H  0.281373 0.963875 -0.894842
H  -3.406961 -1.168907 -0.917869
H  -3.411208 -1.19433 0.881468
H  -5.490399 -0.045085 -0.00772
H  -4.468406 1.111509 0.907211
H  -4.463334 1.138038 -0.882168
H  3.527421 -1.805007 -0.000477
H  4.685277 -0.466715 0.003521
