program: Gaussian 09
title: 000213909
version: EM64L-G09RevD.01
frameworkgroup: C1[X(C20H22N2O2)]
method: RPBEPBE
basis: SDD
operation: Freq
keyword: #p
keyword: freq=noraman
keyword: PBEPBE/SDD
title: #p freq=noraman PBEPBE/SDD
converged: YES YES NO NO
title: Mulliken charges:
elementType: O O N N C C C C C C C C C C C C C C C C C C C C H H H H H H H H H H H H H H H H H H H H H H
charge: -0.259784 -0.255237 -0.238840 -0.275815 0.086163 -0.473289 0.177481 -0.359619 0.049817 -0.345894 0.423652 0.442725 -0.696787 -0.356430 -0.372434 -0.375169 -0.357591 -0.206019 -0.214285 -0.218734 -0.210411 -0.503309 -0.250123 -0.254837 0.200556 0.236242 0.239836 0.177676 0.187166 0.205994 0.216061 0.206201 0.217591 0.269189 0.265030 0.288188 0.259294 0.229974 0.227698 0.225928 0.224835 0.231222 0.242369 0.235979 0.230537 0.227204
chargesum: 0.00000
title: Mulliken charges with hydrogens summed into heavy atoms:
elementType: O O N N C C C C C C C C C C C C C C C C C C C C
charge: -0.259784 -0.255237 -0.238840 -0.275815 0.086163 -0.036491 0.177481 0.057893 0.049817 0.047267 0.423652 0.442725 -0.056934 -0.087241 -0.107404 -0.086981 -0.098298 0.023956 0.013413 0.007194 0.014424 0.206262 -0.019586 -0.027633
polarizability: 2.95735664e+02 7.97285597e+00 2.67841916e+02 9.30859220e+00 -1.99152194e+01 1.68742055e+02
1716.lowfreq: -6.1830 -3.8472 -0.0003 0.0004 0.0005 3.9902 26.4345 34.6041 37.2270
frequency: 25.7506 34.4984 37.1784 44.3292 53.8433 60.4555 67.9769 72.2489 97.3697 111.9859 124.2155 138.9318 177.1294 205.1232 212.5024 222.0216 226.9351 249.7046 266.5052 273.8915 289.9538 298.1631 342.7096 361.6098 406.7135 410.0014 424.5400 443.1757 495.2733 501.2171 522.6374 553.0738 609.1402 612.3036 628.6454 643.2907 662.5638 689.0010 694.3613 705.9303 725.5172 731.1549 758.5398 762.8047 791.9957 812.1974 836.6952 842.1432 853.0577 897.4518 906.7131 914.7856 919.2857 955.5727 968.1391 973.8403 986.0254 987.9737 988.4582 992.6716 1007.8256 1021.2264 1025.6109 1042.1788 1072.2654 1074.8524 1079.4310 1091.9386 1107.8813 1110.8654 1119.4764 1135.0379 1171.6522 1172.5312 1172.5957 1184.9987 1190.1048 1198.5991 1229.0823 1256.0139 1284.9857 1291.7123 1296.9940 1299.9990 1318.6722 1327.0018 1333.1192 1351.2734 1360.8699 1383.0230 1386.5146 1389.1577 1439.7707 1444.4449 1448.7287 1453.5807 1460.8474 1467.9644 1474.6384 1476.7696 1478.9999 1480.1566 1484.0412 1487.1669 1590.0890 1593.6771 1604.5925 1606.4078 1617.4584 1634.3510 2959.6233 2964.7347 2973.2361 2987.7438 2991.9850 3008.5435 3032.1222 3058.0526 3069.6371 3073.8478 3095.3886 3128.9426 3131.0864 3131.5936 3140.3086 3141.5679 3159.1867 3159.4051 3171.1511 3173.3541 3181.3800 3192.0079
redmass: 3.8927 4.0317 3.7255 4.7067 3.8267 3.9336 1.5697 5.3928 4.3711 3.3540 2.7748 3.7909 1.2179 4.0855 4.3166 2.2821 1.4444 3.4438 4.3142 4.6222 3.7894 4.3412 6.6655 6.2229 2.9046 2.9063 3.3877 6.3642 4.1379 3.4419 5.4292 8.1078 6.7889 6.4068 7.8648 7.1732 6.1516 2.6093 2.2213 1.8710 3.4961 1.3747 1.6139 1.6197 2.1834 3.1570 1.2768 1.3005 4.3954 1.7698 1.4165 1.4461 1.4761 4.8561 1.3908 1.3811 3.7939 2.0463 2.6924 1.3399 4.1221 2.6619 2.4313 2.1800 2.5440 2.0712 1.9276 2.1942 2.1856 1.2683 2.2823 2.1035 1.6567 1.0713 1.1322 1.1430 1.1310 2.6715 1.8234 1.3026 1.1942 2.1070 1.4982 2.7016 1.5058 1.4788 1.5685 1.5917 3.1914 8.5861 9.6330 1.2147 1.6207 2.1001 1.9926 1.0945 1.0656 1.0659 1.0675 1.0442 2.3191 1.0701 2.3116 1.0829 6.4483 6.6511 7.2510 6.1451 7.7135 10.6111 1.0616 1.0630 1.0365 1.0520 1.0404 1.0950 1.0982 1.1006 1.1002 1.0999 1.1053 1.0850 1.0854 1.1030 1.0902 1.0899 1.0952 1.0950 1.0968 1.0968 1.0976 1.0957
irintensity: 0.5453 0.7335 4.8715 0.3649 0.5861 1.1516 0.3733 0.2208 0.3702 0.5680 1.0123 3.0885 1.3141 3.4461 0.5750 0.5500 0.1347 4.7315 1.3146 1.7156 9.3850 1.7950 8.1762 1.4398 0.9201 2.1006 2.8151 15.2602 2.4021 17.1621 10.0400 10.1490 0.6286 1.3739 7.5183 21.2372 0.3413 16.6818 20.2601 49.2205 3.1403 14.7435 61.9141 53.3876 31.8597 5.1612 0.4194 0.6690 3.3447 6.8670 5.1096 6.3028 21.2084 56.3521 0.7025 0.1339 0.1843 0.1275 0.4063 0.7016 3.5494 17.2518 1.0322 33.1779 0.1339 15.6275 8.9340 52.0193 6.7294 0.6884 9.5135 24.8381 13.6632 1.1032 2.0830 0.7739 2.5208 6.7281 22.5690 1.9427 8.7325 96.1315 35.0903 95.7120 75.9058 56.0307 19.4375 2.7274 295.0901 1.4748 6.7386 11.5558 25.0991 14.0778 28.0901 21.8381 5.1701 2.3381 10.1728 8.5307 100.6180 17.9848 123.3133 23.2273 3.6306 7.9758 335.3147 38.1215 234.8712 30.9441 8.7526 47.8714 41.0905 26.5426 74.9980 9.9806 3.0208 22.1267 81.0302 68.1969 31.1275 0.3838 0.1390 15.1902 18.1792 14.3639 40.1453 28.6910 9.2043 6.8981 3.4116 1.8395
temp: 298.150 k
press: 1.00000 atm
elementType: 8 8 7 7 6 6 6 6 6 6 6 6 6 6 6 6 6 6 6 6 6 6 6 6 1 1 1 1 1 1 1 1 1 1 1 1 1 1 1 1 1 1 1 1 1 1
symmnumber: 1
zpe: 982481.0 jmol-1
zpe.correction: 0.374207 hartree
zpe.thermalcorrener: 0.397222 hartree
zpe.thermalcorrenthalpy: 0.398166 hartree
zpe.thermalcorrgfe: 0.319827 hartree
zpe.sumelectzpe: -1033.502261 hartree
zpe.sumelectthermal: -1033.479246 hartree
zpe.sumelectthermalent: -1033.478302 hartree
zpe.sumelectthermalfe: -1033.556641 hartree
dipole: -0.1795 4.8550 -0.1890
dipole: 4.8620
quadrupole: -126.7090 -137.4793 -138.5483
quadrupole: -8.4897 4.2628 -5.0923
quadrupole: 7.5366 -3.2338 -4.3028 -8.4897 4.2628 -5.0923
hfenergy: -1033.8764681 hartree
pointgroup: C01 [X(C20H22N2O2)]
dipole: -0.2030495 -1.8601535 0.3970401 debye
polarizability: 292.3939608|-14.165902|260.5815425|-17.1005623|-33.3086347|179.3441314 unknown
InChI: InChI=1S/C20H22N2O2/c1-3-4-15-18-19(23)21(16-11-7-5-8-12-16)22(20(18)24-2)17-13-9-6-10-14-17/h5-14H,3-4,15H2,1-2H3
charge 0 multiplicity 1
46 atoms
O  -1.210645 -1.951403 1.578699
O  -1.171399 2.496144 -0.429531
N  0.372404 -0.547928 0.56957
N  0.416853 0.725231 -0.082007
C  -1.755959 0.368691 0.680298
C  -3.190308 0.727465 0.984421
C  -0.969184 -0.729568 0.99064
C  -4.136333 0.58377 -0.239349
C  -0.895968 1.331296 -0.013066
C  -5.570636 1.075304 0.057191
C  1.202374 -1.622695 0.069128
C  1.655441 1.439395 -0.181426
C  -6.510371 0.944108 -1.160566
C  1.676331 -1.607675 -1.265731
C  1.553525 -2.680155 0.943372
C  1.742775 2.520892 -1.09673
C  2.774537 1.086188 0.614984
C  2.499492 -2.659178 -1.721907
C  2.361922 -3.734608 0.467774
C  2.950933 3.241632 -1.202578
C  3.97964 1.807668 0.483285
C  -2.602016 -2.435021 1.645138
C  2.84239 -3.728604 -0.862728
C  4.076899 2.888375 -0.423061
H  -3.584654 0.144323 1.836275
H  -3.20413 1.791083 1.29528
H  -3.711302 1.165172 -1.079899
H  -4.167166 -0.475962 -0.569781
H  -5.98855 0.504966 0.912969
H  -5.52777 2.135116 0.380224
H  -7.528308 1.307135 -0.927628
H  -6.593809 -0.109549 -1.488122
H  -6.129355 1.53174 -2.016589
H  1.406371 -0.782461 -1.93073
H  1.189495 -2.672979 1.973779
H  0.867402 2.798799 -1.687199
H  2.700141 0.264356 1.332137
H  2.869101 -2.642757 -2.753063
H  2.627552 -4.554651 1.143974
H  3.010563 4.081301 -1.903909
H  4.841852 1.52668 1.098346
H  -3.129218 -1.974103 2.497818
H  -2.516307 -3.520689 1.799271
H  -3.137313 -2.222507 0.703161
H  3.480505 -4.542712 -1.222813
H  5.014001 3.447275 -0.518819
