program: Gaussian 09
title: 000213861
version: EM64L-G09RevD.01
frameworkgroup: C1[X(C6H10O)]
method: RPBEPBE
basis: SDD
operation: Freq
keyword: #pfreq=noraman
keyword: PBEPBE/SDD
title: #p freq=noraman PBEPBE/SDD
converged: YES YES NO YES
title: Mulliken charges:
elementType: O C C C C C C H H H H H H H H H H
charge: -0.257777 0.028289 -0.430893 -0.420415 -0.711521 -0.230726 -0.137286 0.209969 0.204086 0.221435 0.211143 0.215110 0.236453 0.204418 0.224081 0.209286 0.224347
chargesum: 0.00000
title: Mulliken charges with hydrogens summed into heavy atoms:
elementType: O C C C C C C
charge: -0.257777 0.238258 -0.005371 0.005838 -0.046569 -0.021440 0.087061
polarizability: 7.73141938e+01 2.80736181e+00 6.72556048e+01 -1.04457040e-01 1.78719802e+00 4.74955682e+01
1716.lowfreq: -0.0010 -0.0009 -0.0005 10.4585 17.8127 29.6521 128.7306 201.2886 214.9873
frequency: 128.7225 201.2836 214.9829 302.0254 404.8035 444.9825 480.5204 505.4419 717.1634 726.3687 781.1810 843.2316 895.7055 912.7119 933.5572 947.3364 1009.4362 1061.2986 1065.2755 1106.2295 1147.3961 1196.4468 1213.8530 1231.6451 1295.6082 1319.3425 1326.1170 1354.9800 1368.9305 1392.5936 1451.7237 1462.4090 1465.8756 1477.0164 1650.2670 2960.0094 2964.6900 2990.4600 2993.6463 3018.1950 3057.6143 3090.7795 3097.7110 3142.8161 3176.9429
redmass: 3.1906 1.1152 1.6822 2.4741 2.2168 4.0917 2.7602 3.7740 1.3276 2.9662 1.9409 2.4571 3.2337 1.2693 2.0545 1.4324 2.5224 1.8087 1.7170 1.6727 1.9708 1.5205 1.4821 1.2745 1.2868 1.2084 1.4489 1.5793 1.5756 1.2598 1.0813 1.0524 1.0958 1.0486 6.2907 1.0713 1.0771 1.0429 1.0564 1.0929 1.1032 1.0993 1.1001 1.0857 1.1011
irintensity: 2.1802 0.0930 1.2080 1.4575 9.6633 2.2770 11.6805 4.4797 50.6497 2.6199 8.2353 9.8085 0.7224 0.3918 4.8034 4.4991 54.1065 37.8462 42.9552 9.4829 5.1840 2.4074 40.2197 51.2243 0.2897 4.8931 2.9954 6.0590 1.5118 24.3435 3.2000 13.3152 6.8878 11.0120 71.5253 23.3168 56.1133 6.2651 40.4931 42.1995 36.1270 38.3523 29.9161 2.9922 34.3237
temp: 298.150 k
press: 1.00000 atm
elementType: 8 6 6 6 6 6 6 1 1 1 1 1 1 1 1 1 1
symmnumber: 1
zpe: 385971.1 jmol-1
zpe.correction: 0.147009 hartree
zpe.thermalcorrener: 0.153894 hartree
zpe.thermalcorrenthalpy: 0.154839 hartree
zpe.thermalcorrgfe: 0.116515 hartree
zpe.sumelectzpe: -309.276891 hartree
zpe.sumelectthermal: -309.270006 hartree
zpe.sumelectthermalent: -309.269061 hartree
zpe.sumelectthermalfe: -309.307385 hartree
dipole: -0.0004 1.7083 0.3384
dipole: 1.7415
quadrupole: -40.7268 -42.8625 -44.0204
quadrupole: -1.8335 -0.7509 0.2453
quadrupole: 1.8098 -0.3259 -1.4839 -1.8335 -0.7509 0.2453
hfenergy: -309.4239 hartree
pointgroup: C01 [X(C6H10O1)]
dipole: 0.0073593 -0.6712332 0.137195 debye
dipolederiv: -1.319885 -0.0483388 -0.0463203 0.3481572 -0.49782 0.0124215 -0.0346406 0.0291032 -0.2890078 0.5551553 -0.1003573 0.0517835 -0.400497 0.4153096 -0.0352409 0.1051946 -0.0161334 0.4001181 -0.0740347 -0.0806673 -0.0038152 -0.0072351 -0.0343909 -0.0437359 -0.0318055 -0.0622949 0.0764401 -0.0247526 -0.001536 0.0072855 0.0336123 0.0629784 0.0052685 0.0100721 0.0218294 0.2461536 -0.1566927 0.0029819 0.0253465 -0.0183508 0.04166 -0.004996 0.0231025 -0.0097879 0.0642484 -0.2189115 -0.0751074 0.0043946 -0.2298076 -0.0512086 -0.0289516 0.0588584 -0.0291345 -0.366689 1.1408053 0.1067705 0.0276537 0.1028888 0.2341251 -0.029374 -0.0228329 -0.0265874 -0.0812959 -0.0026232 -0.0031697 0.0639739 0.0749161 0.0056235 0.0062439 -0.0292674 0.0194051 -0.1962081 0.0152621 0.1142779 -0.0204043 0.129566 -0.1161431 0.0356614 -0.0283265 0.0559091 0.0752663 0.0390411 -0.0189445 0.0284786 -0.0275855 0.0760289 0.0427411 0.0356609 -0.0173468 -0.1475641 0.0727338 0.044712 0.0149684 -0.0216718 -0.0201769 0.0810034 0.0632977 0.1272698 -0.1371111 -0.0233058 -0.0745422 -0.0721124 -0.0982892 -0.0609302 -0.0742431 -0.0913011 -0.1177975 0.0158044 0.0257945 -0.0736192 -0.0308126 -0.1329952 -0.0457296 -0.076886 -0.038478 -0.0808736 0.0609451 0.0147622 0.0676165 -0.0209551 0.1297649 -0.0723571 0.0770047 -0.0359799 0.0765702 0.0677194 0.0790893 0.0029088 -0.0166058 -0.0118378 0.1006844 -0.0005247 0.0563363 0.0041169 -0.1446766 -0.13123 0.0774834 -0.0002081 0.0460262 0.0480512 0.0008772 -0.0101348 0.0016351 0.1801895 0.0087918 0.0595316 -0.0126509 0.0833386 -0.0857047 0.0327306 -0.0297558 0.0241171 0.1756678 unknown
polarizability: 77.2575274|2.9007672|67.2901238|-0.0059381|-1.917539|47.5177157 unknown
InChI: InChI=1S/C6H10O/c1-6-4-2-3-5-7-6/h3,5-6H,2,4H2,1H3
charge 0 multiplicity 1
17 atoms
O  0.414264 1.20925 -0.074376
C  0.992919 -0.10675 0.345088
C  0.209675 -1.270324 -0.297363
C  -1.278067 -1.234596 0.133388
C  2.469201 -0.05044 -0.044932
C  -1.813627 0.182891 0.03395
C  -0.988555 1.256919 -0.09504
H  0.881436 -0.156854 1.449501
H  0.682575 -2.228583 -0.01144
H  0.284991 -1.176449 -1.397905
H  -1.388784 -1.62581 1.166227
H  -1.872123 -1.908797 -0.514033
H  2.948584 0.844271 0.387985
H  2.999966 -0.946489 0.324493
H  2.576928 -0.003556 -1.142957
H  -2.895102 0.354285 0.024054
H  -1.334478 2.28513 -0.237342
