program: Gaussian 09
title: 000213865
version: EM64L-G09RevD.01
frameworkgroup: C1[X(C14H17N3O)]
method: RPBEPBE
basis: SDD
operation: Freq
keyword: #p
keyword: freq=noraman
keyword: PBEPBE/SDD
title: #p freq=noraman PBEPBE/SDD
converged: YES YES NO NO
title: Mulliken charges:
elementType: O N N N C C C C C C C C C C C C C C H H H H H H H H H H H H H H H H H
charge: -0.291080 -0.170697 -0.356953 -0.085498 0.146626 0.117407 0.388872 -0.337116 -0.471662 0.188529 -0.512916 -0.426012 -0.410599 0.116124 -0.379294 -0.245030 -0.627158 -0.615220 0.242303 0.206662 0.267021 0.222517 0.185990 0.243122 0.222286 0.271741 0.322261 0.271705 0.224983 0.221794 0.251317 0.181496 0.185196 0.225471 0.225810
chargesum: 0.00000
title: Mulliken charges with hydrogens summed into heavy atoms:
elementType: O N N N C C C C C C C C C C C C C C
charge: -0.291080 -0.170697 -0.034692 -0.085498 0.146626 0.117407 0.388872 0.111849 -0.204642 0.188529 -0.104409 0.039396 -0.138857 0.116124 -0.107589 -0.020046 0.027449 0.021257
polarizability: 2.28602285e+02 -9.35531067e-02 1.96745022e+02 7.23390735e+00 3.53082435e+00 1.02638524e+02
1716.lowfreq: -13.2889 -0.0005 0.0007 0.0008 2.1998 4.7275 36.2701 45.6871 65.0786
frequency: 35.6329 45.3697 64.9850 79.3257 112.4945 157.0549 194.0798 221.3450 235.0288 236.9888 242.2667 271.6521 291.0209 319.8301 331.5291 346.0691 392.0766 402.0915 446.5745 456.1525 505.0899 528.3665 566.8973 579.6484 590.2616 604.2822 620.0272 641.8622 693.6316 732.9711 754.4942 771.3019 792.1455 815.2486 829.2427 858.3318 919.9831 946.1999 953.8556 978.3868 989.8088 1016.1875 1034.6375 1040.7562 1057.5641 1070.0589 1088.4061 1115.7387 1129.4438 1150.2481 1164.3351 1171.7374 1187.9987 1212.2698 1226.2873 1253.9398 1258.0202 1267.6235 1302.0378 1339.1624 1346.8235 1358.5474 1365.2920 1373.1334 1383.7235 1406.9109 1414.6170 1417.2922 1439.5425 1443.4396 1457.3653 1459.7277 1467.1636 1472.7273 1473.5399 1474.9616 1485.2972 1486.1227 1563.3287 1586.2349 1589.8358 1618.2047 2818.7383 2842.0686 2857.8882 2979.3229 2980.6178 2988.0203 3016.2880 3027.6632 3053.6258 3068.0823 3075.6768 3088.9923 3138.1285 3158.9124 3170.6662 3209.1175 3533.1351
redmass: 3.0159 4.1002 3.5593 4.3395 3.9724 3.6719 3.2144 1.8174 1.4331 1.9636 2.5109 2.3775 2.4100 3.7665 2.4776 3.8869 3.3199 5.2141 2.6626 3.6264 4.3906 4.3520 3.3415 1.8459 2.9232 3.1542 3.0558 3.9894 4.2205 6.1924 2.4242 2.5612 2.1059 2.8048 2.3238 3.6995 2.7173 1.3849 2.3612 1.7723 1.3410 2.4836 1.6164 3.1006 2.1960 2.3736 1.2590 2.3664 1.5029 2.8261 1.3723 1.8533 1.5134 2.0443 1.4191 1.3798 2.5153 1.6167 2.0859 1.9850 1.8691 1.7047 1.8271 1.8044 2.5967 2.1827 1.1559 2.6531 1.2257 2.3823 1.0470 1.0769 1.1618 1.1784 1.0585 1.6847 1.2038 1.5564 6.8897 4.6856 6.7361 6.9038 1.0706 1.0573 1.0575 1.0855 1.0665 1.0613 1.0716 1.0721 1.1020 1.0976 1.1010 1.1004 1.0866 1.0918 1.0985 1.0980 1.0764
irintensity: 0.1421 0.0661 1.1952 5.2059 0.3666 3.4452 0.3721 1.0845 0.6738 3.0091 3.1538 2.2556 1.0950 5.9277 11.9749 2.2679 0.6194 12.7443 0.6306 2.0751 5.0991 2.5585 1.1628 34.3303 20.1435 11.9243 18.1333 14.5359 2.6746 37.5604 54.7102 8.3548 8.3938 38.0483 17.2631 5.6842 13.2970 0.6553 16.5017 12.4314 1.5570 28.8717 33.2310 50.3586 18.7586 11.3036 3.9849 9.2243 7.7644 23.8596 4.0918 3.9932 17.5710 5.2270 8.6334 1.5947 7.3459 7.8429 93.6902 39.2946 62.8856 57.9959 8.7992 6.1179 23.2244 37.4028 4.3046 79.0768 7.6922 32.2658 14.6906 7.0478 38.2555 8.5305 10.2869 25.6704 15.6054 7.6148 30.0068 236.8661 3.2486 49.4121 65.0972 73.9585 267.7130 30.3748 48.8772 43.4288 40.3980 33.6826 23.6155 35.6936 31.4011 36.0073 9.1222 0.2033 16.0782 0.8473 33.5051
temp: 298.150 k
press: 1.00000 atm
elementType: 8 7 7 7 6 6 6 6 6 6 6 6 6 6 6 6 6 6 1 1 1 1 1 1 1 1 1 1 1 1 1 1 1 1 1
symmnumber: 1
zpe: 758018.7 jmol-1
zpe.correction: 0.288714 hartree
zpe.thermalcorrener: 0.304784 hartree
zpe.thermalcorrenthalpy: 0.305728 hartree
zpe.thermalcorrgfe: 0.245095 hartree
zpe.sumelectzpe: -781.854892 hartree
zpe.sumelectthermal: -781.838822 hartree
zpe.sumelectthermalent: -781.837878 hartree
zpe.sumelectthermalfe: -781.898511 hartree
dipole: -2.4353 -5.7662 0.7318
dipole: 6.3020
quadrupole: -107.5050 -96.6391 -107.8881
quadrupole: -18.0025 4.0468 0.2888
quadrupole: -3.4942 7.3716 -3.8774 -18.0025 4.0468 0.2888
hfenergy: -782.1436062 hartree
pointgroup: C01 [X(C14H17N3O1)]
dipole: 1.132248 2.1960646 -0.2065204 debye
polarizability: 228.0074789|-4.6694122|191.5345215|-9.53079|-22.0642041|108.4438304 unknown
InChI: InChI=1S/C14H17N3O/c1-16(2)8-10-9-17-7-6-15-14(18)12-5-3-4-11(10)13(12)17/h3-5,9,15H,6-8H2,1-2H3
charge 0 multiplicity 1
35 atoms
O  -4.192598 -0.977969 0.297621
N  -0.466015 1.41695 -0.602389
N  -3.491779 1.208023 0.222181
N  3.830278 -0.287102 0.28706
C  -0.630674 0.096242 -0.157804
C  0.679981 -0.514898 -0.168064
C  1.630749 0.480338 -0.63211
C  -1.521254 2.422661 -0.763133
C  0.896433 1.634291 -0.881264
C  -1.791883 -0.635868 0.232979
C  3.106018 0.290168 -0.876889
C  -2.558908 2.330802 0.376081
C  0.837712 -1.862055 0.238215
C  -3.215967 -0.159977 0.252732
C  -1.588997 -1.989769 0.605709
C  -0.306215 -2.591785 0.619072
C  3.763469 0.567036 1.488805
C  5.217275 -0.65003 -0.062477
H  -2.039625 2.303393 -1.734649
H  -1.04288 3.418912 -0.746696
H  1.235525 2.604521 -1.242428
H  3.255769 -0.411865 -1.722715
H  3.550294 1.271081 -1.195476
H  -2.022656 2.282337 1.34477
H  -3.160589 3.256451 0.375538
H  1.839577 -2.301496 0.263423
H  -4.494594 1.410119 0.222496
H  -2.480202 -2.563157 0.880963
H  -0.209888 -3.636653 0.932582
H  4.244373 0.047938 2.337027
H  2.709076 0.755468 1.751861
H  4.270986 1.557068 1.353036
H  5.850703 0.230492 -0.344341
H  5.216569 -1.355113 -0.913557
H  5.697938 -1.151156 0.796641
