program: Gaussian 09
title: 000213848
version: EM64L-G09RevD.01
frameworkgroup: C1[X(C12H26O2)]
method: RPBEPBE
basis: SDD
operation: Freq
keyword: #pfreq=noraman
keyword: PBEPBE/SDD
title: #p freq=noraman PBEPBE/SDD
converged: NO YES NO NO
title: Mulliken charges:
elementType: O O C C C C C C C C C C C C H H H H H H H H H H H H H H H H H H H H H H H H H H
charge: -0.445471 -0.467581 0.346132 0.323966 -0.434362 -0.393984 -0.406822 -0.412875 -0.409366 -0.388597 -0.735915 -0.778800 -0.752136 -0.734741 0.192387 0.193793 0.224039 0.185270 0.199453 0.208185 0.211865 0.195673 0.229605 0.190880 0.197299 0.187596 0.235711 0.203443 0.211971 0.215124 0.226224 0.209918 0.206920 0.214170 0.218505 0.246917 0.206983 0.197991 0.336432 0.344199
chargesum: 0.00000
title: Mulliken charges with hydrogens summed into heavy atoms:
elementType: O O C C C C C C C C C C C C
charge: -0.109039 -0.123382 0.346132 0.323966 -0.048182 0.015325 0.000816 -0.005337 0.011120 -0.003702 -0.084791 -0.127535 -0.112541 -0.082850
polarizability: 1.62096089e+02 -1.11013986e+00 1.26725285e+02 -2.52038067e+00 1.54723304e+00 1.24826182e+02
1716.lowfreq: -12.5189 -1.0624 -0.0007 -0.0005 0.0002 2.5071 16.8368 33.2221 60.8204
frequency: 12.0814 32.4196 60.5352 74.5103 89.7542 111.1714 131.8007 154.5922 162.1423 192.5638 199.2387 216.7249 225.6479 234.0579 237.5671 246.0533 254.7328 309.2525 316.3269 321.8902 342.3541 353.4335 363.0774 395.7500 417.0918 454.7953 490.1864 502.5962 567.4084 724.6207 734.6762 748.3503 764.0356 869.8869 895.6386 904.3278 907.1110 916.2122 933.2304 937.7788 954.7978 962.7422 978.9037 985.0816 1001.1976 1004.2526 1047.2544 1049.6798 1057.1493 1077.5221 1097.1268 1129.1333 1145.7002 1169.6546 1207.9717 1210.1326 1217.6329 1242.7237 1248.2439 1270.2254 1282.9695 1288.1326 1304.7138 1311.1592 1318.5583 1333.5395 1350.5070 1355.2812 1369.9685 1372.1173 1379.1114 1380.8958 1394.6073 1405.7936 1448.3527 1453.8024 1460.5456 1462.7001 1463.6722 1466.1336 1468.7134 1472.3481 1474.6626 1477.4555 1480.1699 1490.0511 1491.3551 1493.5053 2930.7138 2936.0719 2944.1603 2959.2623 2960.0089 2962.7464 2967.0039 2971.7074 2972.4784 2976.4636 2982.6798 2992.0176 3006.9676 3030.5376 3048.2821 3052.2532 3056.9725 3062.4215 3063.5718 3068.8458 3070.5442 3078.1699 3079.4365 3087.6415 3570.0906 3579.6864
redmass: 3.5453 3.9225 3.2131 3.2038 1.8478 2.7601 2.9550 2.0218 2.6878 1.0997 1.3349 2.4075 1.5536 1.5865 1.0740 1.0731 2.7729 2.3730 1.9944 2.0348 1.3942 2.5740 2.3088 1.9965 2.3733 2.7442 2.6801 3.1557 3.0280 1.1490 3.2064 2.4000 1.4472 1.5877 2.1782 1.7303 1.6457 1.9193 1.4267 1.3326 1.8486 1.9526 2.8315 2.6324 1.8883 1.4714 3.0564 2.3099 1.6318 2.3108 1.3270 1.3905 1.4203 1.4046 1.4982 2.3341 1.7708 1.7350 1.8472 1.6520 1.8474 1.3720 1.2550 1.3775 1.3410 1.2994 1.4760 1.5311 1.2011 1.2187 1.2106 1.2596 1.2118 1.3365 1.0804 1.0684 1.0656 1.0727 1.0776 1.0548 1.0535 1.0572 1.0630 1.0610 1.0932 1.0602 1.0695 1.0601 1.0545 1.0687 1.0592 1.0526 1.0417 1.0614 1.0366 1.0385 1.0591 1.0372 1.1048 1.0980 1.0978 1.1009 1.1033 1.0990 1.0992 1.0984 1.0983 1.0991 1.0985 1.0971 1.0961 1.0989 1.0658 1.0666
irintensity: 0.0864 0.3674 0.3827 0.3134 0.1494 2.5609 4.0290 1.9096 13.7351 0.1732 0.4078 2.0063 6.0818 4.6974 142.7741 10.1803 7.5355 0.2225 46.5928 9.4611 72.0119 0.5132 6.7588 8.5932 3.8984 3.0658 10.2780 3.4976 3.4442 10.1473 0.2945 5.9155 4.0672 7.2764 4.0800 13.8078 8.4210 1.2950 3.2358 5.7693 16.7606 27.6180 98.8314 22.0562 18.3145 0.1324 0.1233 0.7229 17.4783 0.0606 5.9802 31.7792 21.5277 5.8724 6.4516 14.6465 5.3795 2.0579 0.9465 20.6842 3.6603 2.0951 2.7080 4.5857 1.0765 4.1459 4.1880 3.4256 24.3036 22.0659 10.0021 15.5065 13.5707 5.3079 1.1711 0.5010 4.0935 0.3278 2.2146 2.7412 0.6017 3.6571 4.9030 10.2832 2.4544 9.8474 37.4343 19.6365 63.1035 60.4682 29.3464 8.7857 34.1850 12.6438 23.6500 48.0006 75.3673 26.2731 79.6177 11.5183 6.1703 8.2905 72.2942 71.0060 8.8479 99.2868 15.8337 43.7228 39.9124 19.9817 57.0695 26.5305 5.3740 2.2834
temp: 298.150 k
press: 1.00000 atm
elementType: 8 8 6 6 6 6 6 6 6 6 6 6 6 6 1 1 1 1 1 1 1 1 1 1 1 1 1 1 1 1 1 1 1 1 1 1 1 1 1 1
symmnumber: 1
zpe: 943400.9 jmol-1
zpe.correction: 0.359322 hartree
zpe.thermalcorrener: 0.378389 hartree
zpe.thermalcorrenthalpy: 0.379333 hartree
zpe.thermalcorrgfe: 0.311513 hartree
zpe.sumelectzpe: -622.107942 hartree
zpe.sumelectthermal: -622.088875 hartree
zpe.sumelectthermalent: -622.087931 hartree
zpe.sumelectthermalfe: -622.155751 hartree
dipole: 1.5713 -0.3752 3.3999
dipole: 3.7642
quadrupole: -91.6294 -89.6557 -90.9892
quadrupole: 1.6026 -3.9312 6.7157
quadrupole: -0.8713 1.1024 -0.2311 1.6026 -3.9312 6.7157
hfenergy: -622.4672639 hartree
pointgroup: C01 [X(C12H26O2)]
dipole: -0.6077474 0.3081055 1.3148912 debye
polarizability: 162.1223768|-0.9795485|126.3421507|2.3721469|-1.7327806|125.1830285 unknown
InChI: InChI=1S/C12H26O2/c1-11(2,9-13)7-5-6-8-12(3,4)10-14/h13-14H,5-10H2,1-4H3
charge 0 multiplicity 1
40 atoms
O  4.789391 -1.367703 -0.876138
O  -3.359213 -1.941855 0.801953
C  3.19462 0.294079 0.187273
C  -3.404329 0.303126 -0.18077
C  1.729036 0.396319 0.718581
C  -1.944157 0.085066 -0.688775
C  0.592218 0.16631 -0.305523
C  -0.808536 0.36557 0.320898
C  3.396677 -1.096153 -0.482327
C  -3.673063 -0.53141 1.093136
C  3.510183 1.414958 -0.83551
C  4.157436 0.428102 1.399261
C  -3.658932 1.793622 0.166953
C  -4.385862 -0.142474 -1.296559
H  1.60502 -0.331595 1.549564
H  1.601482 1.402943 1.170071
H  -1.856309 -0.965101 -1.028009
H  -1.798541 0.727105 -1.583201
H  0.705563 0.858798 -1.163659
H  0.650477 -0.860597 -0.718938
H  -0.909531 -0.315496 1.189561
H  -0.881106 1.400838 0.712839
H  2.838889 -1.150858 -1.43148
H  3.019896 -1.893869 0.196696
H  -3.044044 -0.159081 1.930083
H  -4.742016 -0.419806 1.380167
H  4.521194 1.269347 -1.257204
H  3.468854 2.411158 -0.355838
H  2.794998 1.411544 -1.678101
H  5.213687 0.491861 1.075415
H  3.937182 1.350807 1.96717
H  4.052221 -0.425503 2.098581
H  -4.706018 1.954622 0.488498
H  -2.997348 2.150563 0.978057
H  -3.479339 2.429569 -0.719866
H  -4.280341 -1.223732 -1.491673
H  -4.184767 0.405986 -2.236023
H  -5.435831 0.055144 -1.006112
H  5.340431 -1.447991 -0.057618
H  -3.569071 -2.496512 1.593467
